{"text_format":"1","workbook":"xlsx","n_sheets":4,"sheets":["Freeway_Import","Schematic","Listing","Raw-Initial Volume List Entry"],"not_rendered":{"charts":0,"images":0,"macros":1,"external_links":0,"defined_names":127,"comments":0,"pivot_tables":0},"unopened":[],"bounds":{"document_bytes":16777216,"sheet_cells":100000,"rows_first":2000,"rows_last":500,"rows_between":2000,"halvings":0,"cell_chars":16384,"cell_head_chars":4096},"cells_cut":0,"cells_raw":0,"read":"whole","date_system":"1900"}

{"sheet":"Freeway_Import","index":0,"n_rows":9,"n_cols":13,"rows_kept":9,"cut":false,"hidden":false,"merged":[]}
[]
[null,null,"Project",{"$f":"Schematic!$L$3","v":"(Highway XX Project)"}]
[null,null,"Scenario",{"$f":"Schematic!$L$4","v":"(Peak Period)"},null,null,null,null,null,null,"LINK_ID"]
[null,null,null,null,null,null,null,null,null,null,null,{"$f":"\"$\"","v":"$"}]
[null,null,null,null,null,null,null,null,null,null,"imbal",0,0]
[null,null,null,null,null,null,null,null,null,null,0,0,0]
[null,null,null,null,null,null,null,null,null,null,"target","$","$"]
[]
[null,null,"LINK_ID","Corridor","Corridor & Direction","Type","Location","Balanced\nVolume"]

{"sheet":"Schematic","index":1,"n_rows":91,"n_cols":90,"rows_kept":91,"cut":false,"hidden":false,"merged":[]}
[]
[]
[null,null,null,null,null,null,null,null,null,null,"Project","(Highway XX Project)"]
[null,null,null,null,null,null,null,null,null,null,"Scenario","(Peak Period)"]
[]
[]
[]
[]
[]
[null,null,null,null,null,null,null,null,null,"Do not put intersection data on the left side or above the black border"]
[null,null,null,null,null,"Total network imbalance",{"$f":"ABS(AN22)+ABS(U37)+ABS(BC41)+ABS(AJ56)+ABS(AN57)+ABS(BW57)+ABS(U72)+ABS(BD72)+ABS(BC76)+ABS(CL76)+ABS(AJ91)","v":275}]
[]
[]
[null,null,"Balancing Convergence Criteria"]
[null,null,null,null,null,"Maximum Iterations",500]
[null,null,null,null,null,"Max. Tot. Network Imbalance",0.01]
[]
[]
[]
[]
[]
[null,null,null,null,null,null,null,null,null,null,null,null,null,null,null,null,null,null,null,null,null,null,null,null,null,null,null,null,null,null,null,null,null,null,{"$f":"IF(AJ19<>\"\",AVERAGE(AJ22,AJ19),AJ22)","v":211},{"$f":"SUM(AH34:AK34)","v":211},{"$f":"SUM(AH37:AK37)","v":211},null,{"$f":"IF(AM21<>\"\",AM21-AM24,0)","v":0},{"$f":"IF(AN21<>\"\",AN21-AN24,0)","v":0},"imbal"]
[null,null,null,null,null,null,null,null,null,null,null,null,null,null,null,null,null,null,null,null,null,null,null,null,null,null,null,null,null,null,null,null,null,null,"target","$","$",null,"#","#","target"]
[null,null,null,null,null,null,null,null,null,null,null,null,null,null,null,null,null,null,null,null,null,null,null,null,null,null,null,null,null,null,null,null,null,null,null,null,null,null,{"$f":"SUM(AK37,AJ41,AO41,AN35)","v":234},{"$f":"SUM(AK34,AG41,AO44,AQ35)","v":234},{"$f":"IF(AN21<>\"\",AVERAGE(AN24,AN21),AN24)","v":234}]
[null,null,null,null,null,null,null,null,null,null,null,null,null,null,null,null,null,null,null,null,null,null,null,{"$f":"CHOOSE(1,AL39&\":\",\"IX_NAME\",Y25)","v":"1:"},{"$f":"AC40&\" & \"&AK28","v":"Street 2 & Street 1"},null,null,null,null,null,null,null,null,null,null,null,null,null,null,null,null,null,null,null,null,null,"Local OD Raw"]
[null,null,null,null,null,null,null,null,null,null,null,null,null,null,null,null,null,null,null,null,null,null,null,null,"Raw Count Date:",null,null,null,null,null,null,null,null,null,null,null,null,null,null,null,null,null,null,null,null,null,{"$f":"\"local_od_raw_\"&AL39","v":"local_od_raw_1"},1,2,3,4,"est","tgt","err"]
[null,null,null,null,null,null,null,null,null,null,null,null,null,null,null,null,null,null,null,null,null,null,null,null,null,null,null,null,null,null,null,null,null,null,null,null,null,null,null,null,null,null,null,null,null,null,1,{"$f":"AM41","v":0},{"$f":"AP41","v":94},{"$f":"AO41","v":85},{"$f":"AN41","v":85},{"$f":"SUM(AV27:AY27)","v":264},{"$f":"AO56","v":248.5},{"$f":"IFERROR(ABS(AZ27-BA27)/BA27,0)","v":6.2374245472837021E-2}]
[null,null,null,null,null,null,null,null,null,null,null,null,null,null,null,null,null,null,null,null,null,null,null,null,null,null,null,null,null,null,null,null,null,null,null,null,"Street 1",null,null,null,null,null,null,null,null,null,2,{"$f":"AN37","v":64},{"$f":"AN38","v":0},{"$f":"AN35","v":70},{"$f":"AN36","v":56},{"$f":"SUM(AV28:AY28)","v":190},{"$f":"BC36","v":186},{"$f":"IFERROR(ABS(AZ28-BA28)/BA28,0)","v":2.1505376344086023E-2}]
[null,null,null,null,null,null,null,null,null,null,null,null,null,null,null,null,null,null,null,null,null,null,null,null,null,null,null,null,null,null,null,null,null,"",null,null,null,null,null,null,null,null,null,null,null,null,3,{"$f":"AI37","v":98},{"$f":"AJ37","v":55},{"$f":"AK37","v":0},{"$f":"AH37","v":58},{"$f":"SUM(AV29:AY29)","v":211},{"$f":"AI22","v":211},0]
[null,null,null,null,null,null,null,null,null,null,null,null,null,null,null,null,null,null,null,null,null,null,null,null,null,null,null,null,null,null,null,null,null,null,null,null,null,null,null,null,null,null,null,null,null,null,4,{"$f":"AJ43","v":59},{"$f":"AJ42","v":51},{"$f":"AJ41","v":79},{"$f":"AJ40","v":0},{"$f":"SUM(AV30:AY30)","v":189},{"$f":"U42","v":189},0]
[null,null,null,null,null,null,null,null,null,null,null,null,null,null,null,null,null,null,null,null,null,null,null,null,null,null,null,null,null,null,null,null,null,null,null,null,null,null,null,null,null,null,null,null,null,null,"est",{"$f":"SUM(AV27:AV30)","v":221},{"$f":"SUM(AW27:AW30)","v":200},{"$f":"SUM(AX27:AX30)","v":234},{"$f":"SUM(AY27:AY30)","v":199}]
[null,null,null,null,null,null,null,null,null,null,null,null,null,null,null,null,null,null,null,null,null,null,null,null,null,null,null,null,null,null,null,null,"RNSE",{"$f":"RNSE(AH34,AH37)","v":0},{"$f":"RNSE(AI34,AI37)","v":0},0,"-",null,null,null,null,null,null,null,null,null,"tgt",{"$f":"AI54","v":209.5},{"$f":"BA42","v":167.5},{"$f":"AO24","v":234},{"$f":"W36","v":199}]
[null,null,null,null,null,null,null,null,null,null,null,null,null,null,null,null,null,null,null,null,null,null,null,null,null,null,null,null,null,null,null,null,"%",{"$f":"AH34/AJ22","v":0.27488151658767773},{"$f":"AI34/AJ22","v":0.46445497630331756},{"$f":"AJ34/AJ22","v":0.26066350710900477},{"$f":"AK34/AJ22","v":0},null,null,null,null,null,null,null,null,null,"err",{"$f":"IFERROR(ABS(AV31-AV32)/AV32,0)","v":5.4892601431980909E-2},{"$f":"IFERROR(ABS(AW31-AW32)/AW32,0)","v":0.19402985074626866},0,0,null,null,{"$f":"SUM(AV33:AY33,BB27:BB30)","v":0.33280207399517259}]
[null,null,null,null,null,null,null,null,null,null,null,null,null,null,null,null,null,null,null,null,null,null,null,null,null,null,null,null,null,null,null,null,"bal",{"$f":"AY48","v":58},{"$f":"AV48","v":98},{"$f":"AW48","v":55},{"$f":"AX48","v":0},null,null,"raw","%",null,"bal","%","RNSE"]
[null,null,null,null,null,null,null,null,null,null,null,null,null,null,null,null,null,null,null,null,null,null,null,null,null,null,null,null,null,null,null,null,null,8,"$",9,"M",null,{"$f":"CHOOSE(1,\"<\",\"TURN\",8,AL39,AN35,AQ35)","v":"<"},70,{"$f":"AN35/BC38","v":0.36842105263157893},"<",{"$f":"AX47","v":70},{"$f":"AQ35/BC37","v":0.36842105263157893},{"$f":"RNSE(AQ35,AN35)","v":0},null,null,""]
[null,null,null,null,null,null,null,null,null,null,null,null,null,null,null,null,null,null,null,null,"imbal","target",{"$f":"IF(T37<>\"\",AVERAGE(W37,T37),W37)","v":199},null,null,null,null,null,null,null,null,null,"%",{"$f":"AH37/AK22","v":0.27488151658767773},{"$f":"AI37/AK22","v":0.46445497630331756},{"$f":"AJ37/AK22","v":0.26066350710900477},{"$f":"AK37/AK22","v":0},null,{"$f":"CHOOSE(1,\"!\",\"TURN\",7,AL39,AN36,AQ36)","v":"!"},56,{"$f":"AN36/BC38","v":0.29473684210526313},"!",{"$f":"AY47","v":56},{"$f":"AQ36/BC37","v":0.29473684210526313},{"$f":"RNSE(AQ36,AN36)","v":0},null,null,null,null,null,null,null,null,"target",{"$f":"IF(BW59<>\"\",AVERAGE(BC37,BW59),BC37)","v":186}]
[null,null,null,null,null,null,null,null,null,null,null,null,null,null,null,null,null,null,null,null,{"$f":"IF(T37<>\"\",T37-W37,0)","v":0},"!",{"$f":"SUM(AG40,AN44,AQ36,AH34)","v":199},null,null,null,null,null,null,null,null,null,"raw",58,98,55,0,null,{"$f":"CHOOSE(1,\">\",\"TURN\",6,AL39,AN37,AQ37)","v":">"},64,{"$f":"AN37/BC38","v":0.33684210526315789},">",{"$f":"AV47","v":64},{"$f":"AQ37/BC37","v":0.33684210526315789},0,null,null,null,null,null,null,null,null,"!",{"$f":"SUM(AQ35:AQ38)","v":190}]
[null,null,null,null,null,null,null,null,null,null,null,null,null,null,null,null,null,null,null,null,{"$f":"IF(T38<>\"\",T38-W38,0)","v":0},"!",{"$f":"SUM(AJ40,AN41,AN36,AH37)","v":199},null,null,null,null,null,null,null,null,null,null,{"$f":"CHOOSE(1,8,\"TURN\",12,AL39,AH37,AH34)","v":8},{"$f":"CHOOSE(1,\"$\",\"TURN\",11,AL39,AI37,AI34)","v":"$"},{"$f":"CHOOSE(1,\"9\",\"TURN\",10,AL39,AJ37,AJ34)","v":"9"},{"$f":"CHOOSE(1,\"M\",\"TURN\",9,AL39,AK37,AK34)","v":"M"},null,{"$f":"CHOOSE(1,\"N\",\"TURN\",5,AL39,AN38,AQ38)","v":"N"},0,{"$f":"AN38/BC38","v":0},"N",{"$f":"AW47","v":0},{"$f":"AQ38/BC37","v":0},"-",null,null,null,null,null,null,null,null,"!",{"$f":"SUM(AN35:AN38)","v":190}]
[null,null,null,null,null,null,null,null,null,null,null,null,null,null,null,null,null,null,null,null,null,null,null,null,null,null,null,null,null,null,null,null,null,null,null,null,null,1]
[null,null,null,null,null,null,null,null,null,null,null,null,null,null,null,null,null,null,null,null,{"$f":"SUM(AJ40:AJ43)","v":189},"\"",null,null,null,null,null,null,"Street 2",null,{"$f":"RNSE(AG40,AJ40)","v":"-"},{"$f":"AG40/U41","v":0},{"$f":"AY49","v":0},"O",{"$f":"AJ40/U40","v":0},0,{"$f":"CHOOSE(1,\"O\",\"TURN\",13,AL39,AJ40,AG40)","v":"O"},null,{"$f":"CHOOSE(1,\"L\",\"TURN\",1,AL39,AM41,AM44)","v":"L"},{"$f":"CHOOSE(1,\":\",\"TURN\",2,AL39,AN41,AN44)","v":":"},{"$f":"CHOOSE(1,\"#\",\"TURN\",3,AL39,AO41,AO44)","v":"#"},{"$f":"CHOOSE(1,\";\",\"TURN\",4,AL39,AP41,AP44)","v":";"},null,null,null,null,null,null,null,null,null,null,{"$f":"SUM(AN38,AJ37,AJ42,AP41)","v":200},"\"",{"$f":"IF(BT57<>\"\",BT57-BA40,0)","v":-65}]
{"$rows_left_out":52}
{"sheet":"Listing","index":2,"n_rows":49,"n_cols":21,"rows_kept":49,"cut":false,"hidden":false,"merged":[[6,12,6,13]]}
[]
[null,null,null,null,null,null,null,null,"Project",{"$f":"Schematic!$L$3","v":"(Highway XX Project)"}]
[null,null,null,null,null,null,null,null,"Scenario",{"$f":"Schematic!$L$4","v":"(Peak Period)"}]
[]
[null,null,"Intersection Numbers & Names",null,null,null,"Intersection Turning Movement Volume Comparison",null,null,null,null,null,null,null,null,null,null,null,null,"Imbalance Cells"]
[]
[null,null,null,null,null,null,null,null,null,null,null,null,"Volume"]
[null,null,"Intersection\nNumber","Intersection\nName",null,null,"SORT","TURN_ID","Intersection Number","Intersection","Intersection","Turn","Raw","Balanced","Diff.\n(Bal - Raw)","RNSE",null,null,null,"Cell","Value"]
[null,null,1,{"$f":"Schematic!$Y$25","v":"Street 2 & Street 1"},null,null,1,"TURN_001_01",1,{"$f":"INDEX($D$9:$D$11, MATCH($I9,$C$9:$C$11,0))","v":"Street 2 & Street 1"},{"$f":"INDEX($D$9:$D$11, MATCH($I9,$C$9:$C$11,0))","v":"Street 2 & Street 1"},"NBU",{"$f":"INDIRECT(H9 & \"_raw\")","v":0},{"$f":"INDIRECT(H9 & \"_bal\")","v":0},{"$f":"$N9-$M9","v":0},{"$f":"IF($M9>0, SQRT($O9^2/$M9),\"\")","v":""},null,null,null,{"$f":"CELL(\"address\",Schematic!$AN$22)","v":"'[Intersection Balancing Example Triangle.xlsm]Schematic'!$AN$22"},{"$f":"INDIRECT($T9)","v":0}]
[null,null,2,{"$f":"Schematic!$Y$60","v":"Street 3 & Street 1"},null,null,2,"TURN_001_02",1,null,"Street 2 & Street 1","NBL",85,85,0,0,null,null,null,{"$f":"CELL(\"address\",Schematic!$U$37)","v":"'[Intersection Balancing Example Triangle.xlsm]Schematic'!$U$37"},0]
[null,null,3,{"$f":"Schematic!$BH$60","v":"Street 3 & Street 2"},null,null,3,"TURN_001_03",1,null,"Street 2 & Street 1","NBT",85,85,0,0,null,null,null,{"$f":"CELL(\"address\",Schematic!$BC$41)","v":"'[Intersection Balancing Example Triangle.xlsm]Schematic'!$BC$41"},-65]
[null,null,null,null,null,null,4,"TURN_001_04",1,null,"Street 2 & Street 1","NBR",94,94,0,0,null,null,null,{"$f":"CELL(\"address\",Schematic!$AJ$56)","v":"'[Intersection Balancing Example Triangle.xlsm]Schematic'!$AJ$56"},-23]
[null,null,null,null,null,null,5,"TURN_001_05",1,null,"Street 2 & Street 1","WBU",0,0,0,"",null,null,null,{"$f":"CELL(\"address\",Schematic!$AN$57)","v":"'[Intersection Balancing Example Triangle.xlsm]Schematic'!$AN$57"},31]
[null,null,null,null,null,null,6,"TURN_001_06",1,null,"Street 2 & Street 1","WBL",64,64,0,0,null,null,null,{"$f":"CELL(\"address\",Schematic!$BW$57)","v":"'[Intersection Balancing Example Triangle.xlsm]Schematic'!$BW$57"},8]
[null,null,null,null,null,null,7,"TURN_001_07",1,null,"Street 2 & Street 1","WBT",56,56,0,0,null,null,null,{"$f":"CELL(\"address\",Schematic!$U$72)","v":"'[Intersection Balancing Example Triangle.xlsm]Schematic'!$U$72"},0]
[null,null,null,null,null,null,8,"TURN_001_08",1,null,"Street 2 & Street 1","WBR",70,70,0,0,null,null,null,{"$f":"CELL(\"address\",Schematic!$BD$72)","v":"'[Intersection Balancing Example Triangle.xlsm]Schematic'!$BD$72"},136]
[null,null,null,null,null,null,9,"TURN_001_09",1,null,"Street 2 & Street 1","SBU",0,0,0,"",null,null,null,{"$f":"CELL(\"address\",Schematic!$BC$76)","v":"'[Intersection Balancing Example Triangle.xlsm]Schematic'!$BC$76"},-12]
[null,null,null,null,null,null,10,"TURN_001_10",1,null,"Street 2 & Street 1","SBL",55,55,0,0,null,null,null,{"$f":"CELL(\"address\",Schematic!$CL$76)","v":"'[Intersection Balancing Example Triangle.xlsm]Schematic'!$CL$76"},0]
[null,null,null,null,null,null,11,"TURN_001_11",1,null,"Street 2 & Street 1","SBT",98,98,0,0,null,null,null,{"$f":"CELL(\"address\",Schematic!$AJ$91)","v":"'[Intersection Balancing Example Triangle.xlsm]Schematic'!$AJ$91"},0]
[null,null,null,null,null,null,12,"TURN_001_12",1,null,"Street 2 & Street 1","SBR",58,58,0,0]
[null,null,null,null,null,null,13,"TURN_001_13",1,null,"Street 2 & Street 1","EBU",0,0,0,""]
[null,null,null,null,null,null,14,"TURN_001_14",1,null,"Street 2 & Street 1","EBL",79,79,0,0]
[null,null,null,null,null,null,15,"TURN_001_15",1,null,"Street 2 & Street 1","EBT",51,51,0,0]
[null,null,null,null,null,null,16,"TURN_001_16",1,null,"Street 2 & Street 1","EBR",59,59,0,0]
[null,null,null,null,null,null,17,"TURN_002_01",2,{"$f":"INDEX($D$9:$D$11, MATCH($I25,$C$9:$C$11,0))","v":"Street 3 & Street 1"},"Street 3 & Street 1","NBU",0,0,0,""]
[null,null,null,null,null,null,18,"TURN_002_02",2,null,"Street 3 & Street 1","NBL",71,71,0,0]
[null,null,null,null,null,null,19,"TURN_002_03",2,null,"Street 3 & Street 1","NBT",73,73,0,0]
[null,null,null,null,null,null,20,"TURN_002_04",2,null,"Street 3 & Street 1","NBR",86,86,0,0]
[null,null,null,null,null,null,21,"TURN_002_05",2,null,"Street 3 & Street 1","WBU",0,0,0,""]
[null,null,null,null,null,null,22,"TURN_002_06",2,null,"Street 3 & Street 1","WBL",93,93,0,0]
[null,null,null,null,null,null,23,"TURN_002_07",2,null,"Street 3 & Street 1","WBT",78,78,0,0]
[null,null,null,null,null,null,24,"TURN_002_08",2,null,"Street 3 & Street 1","WBR",86,86,0,0]
[null,null,null,null,null,null,25,"TURN_002_09",2,null,"Street 3 & Street 1","SBU",0,0,0,""]
[null,null,null,null,null,null,26,"TURN_002_10",2,null,"Street 3 & Street 1","SBL",51,51,0,0]
[null,null,null,null,null,null,27,"TURN_002_11",2,null,"Street 3 & Street 1","SBT",54,54,0,0]
[null,null,null,null,null,null,28,"TURN_002_12",2,null,"Street 3 & Street 1","SBR",93,93,0,0]
[null,null,null,null,null,null,29,"TURN_002_13",2,null,"Street 3 & Street 1","EBU",0,0,0,""]
[null,null,null,null,null,null,30,"TURN_002_14",2,null,"Street 3 & Street 1","EBL",74,74,0,0]
[null,null,null,null,null,null,31,"TURN_002_15",2,null,"Street 3 & Street 1","EBT",57,57,0,0]
[null,null,null,null,null,null,32,"TURN_002_16",2,null,"Street 3 & Street 1","EBR",50,50,0,0]
{"$rows_left_out":10}
{"sheet":"Raw-Initial Volume List Entry","index":3,"n_rows":27,"n_cols":21,"rows_kept":27,"cut":false,"hidden":false,"merged":[[21,5,21,8],[21,9,21,12],[21,13,21,16],[21,17,21,20],[8,12,8,15],[9,12,9,15],[15,17,15,20],[16,17,16,20],[15,12,15,13],[14,12,14,13],[22,3,22,4],[22,5,22,8],[22,9,22,12],[22,13,22,16],[22,17,22,20]]}
[]
[null,null,null,"Project",{"$f":"Schematic!$L$3","v":"(Highway XX Project)"}]
[null,null,null,"Scenario",{"$f":"Schematic!$L$4","v":"(Peak Period)"}]
[]
[]
[null,null,null,"Transfer Raw/Initial Volumes to/from the Schematic Worksheet"]
[]
[null,null,null,null,null,null,null,null,null,null,null,null,"Turn Numbers in Schematic Orientation"]
[null,null,null,null,null,null,null,null,null,null,null,null,"ê",null,null,null,null,"<",8]
[null,null,null,null,null,null,null,null,null,null,null,null,"Top Leg",null,null,null,null,"!",7,"ç"]
[null,null,null,null,null,null,null,null,null,null,null,null,12,11,10,9,null,">",6,"Right Leg"]
[null,null,null,null,null,null,null,null,null,null,null,null,8,"$","9","M",null,"N",5]
[]
[null,null,null,null,null,null,null,null,null,null,null,null,null,null,13,"O",null,"L",":","#",";"]
[null,null,null,null,null,null,null,null,null,null,null,null,"è",null,14,"=",null,1,2,3,4]
[null,null,null,null,null,null,null,null,null,null,null,null,"Left Leg",null,15,"\"",null,"é"]
[null,null,null,null,null,null,null,null,null,null,null,null,null,null,16,"?",null,"Bottom Leg"]
[]
[]
[]
[null,null,null,null,"Turn Number",12,11,10,9,8,7,6,5,4,3,2,1,16,15,14,13]
[null,null,null,null,null,"ê",null,null,null,"ç",null,null,null,"é",null,null,null,"è"]
[null,null,null,"Intersection",null,"Top Leg",null,null,null,"Right Leg",null,null,null,"Bottom Leg",null,null,null,"Left Leg"]
[null,null,null,"Number","Name","Right ","Thru ","Left ","U-Tn","Right ","Thru ","Left ","U-Tn","Right ","Thru ","Left ","U-Tn","Right ","Thru ","Left ","U-Tn"]
[null,null,null,{"$f":"Schematic!$AL$39","v":1},{"$f":"Schematic!$Y$25","v":"Street 2 & Street 1"},58,98,55,0,70,56,64,0,94,85,85,0,59,51,79,0]
[null,null,null,{"$f":"Schematic!$AL$74","v":2},{"$f":"Schematic!$Y$60","v":"Street 3 & Street 1"},93,54,51,0,86,78,93,0,86,73,71,0,50,57,74,0]
[null,null,null,{"$f":"Schematic!$BU$74","v":3},{"$f":"Schematic!$BH$60","v":"Street 3 & Street 2"},61,null,74,0,84,60,null,0,null,null,null,null,null,84,98,0]