{"text_format":"1","workbook":"xlsx","n_sheets":2,"sheets":["How-To","How-To (with Freeway Link)"],"not_rendered":{"charts":0,"images":0,"macros":1,"external_links":0,"defined_names":1,"comments":1,"pivot_tables":0},"unopened":[],"bounds":{"document_bytes":16777216,"sheet_cells":100000,"rows_first":2000,"rows_last":500,"rows_between":2000,"halvings":0,"cell_chars":16384,"cell_head_chars":4096},"cells_cut":0,"cells_raw":0,"read":"whole","date_system":"1900"}

{"sheet":"How-To","index":0,"n_rows":76,"n_cols":81,"rows_kept":76,"cut":false,"hidden":false,"merged":[]}
[]
[]
[]
[]
[]
[]
[]
[]
[]
[]
[]
[]
[]
[]
[]
[]
[]
[]
[]
[]
[]
[]
[]
[]
[]
[]
[]
[]
[]
[]
[]
[]
[null,null,null,null,null,null,"How to Make an Intersection Template"]
[null,null,null,null,null,null,"(That can be used in the automatic intersection balancing tool)"]
[]
[]
[]
[]
[]
[]
[]
[null,null,null,null,null,null,null,null,null,null,null,null,null,null,null,null,null,null,null,null,null,null,null,null,null,null,null,null,null,null,null,null,null,null,null,null,null,null,null,null,null,null,null,null,null,null,null,null,null,null,null,null,null,null,{"$f":"IF(BD39<>\"\",AVERAGE(BD42,BD39),BD42)","v":1016},{"$f":"SUM(BB54:BE54)","v":1016},{"$f":"SUM(BB57:BE57)","v":1016},null,{"$f":"IF(BG41<>\"\",BG41-BG44,0)","v":0},{"$f":"IF(BH41<>\"\",BH41-BH44,0)","v":0},"imbal"]
[null,null,null,null,null,null,null,null,null,null,null,null,null,null,null,null,null,null,null,null,null,null,null,null,null,null,null,null,null,null,null,null,null,null,null,null,null,null,null,null,null,null,null,null,null,null,null,null,null,null,null,null,null,null,"target","$","$",null,"#","#","target"]
[null,null,null,null,null,null,null,null,null,null,null,null,null,null,null,null,null,null,null,null,null,null,null,null,null,null,null,null,null,null,null,null,null,null,null,null,null,null,null,null,null,null,null,null,null,null,null,null,null,null,null,null,null,null,null,null,null,null,{"$f":"SUM(BE57,BD61,BI61,BH55)","v":794},{"$f":"SUM(BE54,BA61,BI64,BK55)","v":794},{"$f":"IF(BH41<>\"\",AVERAGE(BH44,BH41),BH44)","v":794}]
[null,null,null,null,null,null,null,null,null,null,null,null,null,null,null,null,null,null,null,null,null,null,null,null,null,null,null,null,null,null,null,null,null,null,null,null,null,null,null,null,null,null,null,{"$f":"CHOOSE(1,BF59&\":\",\"IX_NAME\",AS45)","v":"1:"},"Main Ave & Default St",null,null,null,null,null,null,null,null,null,null,null,null,null,null,null,null,null,null,null,null,null,"Local OD Raw"]
[null,null,null,null,null,null,null,null,null,null,null,null,null,null,null,null,null,null,null,null,null,null,null,null,null,null,null,null,null,null,null,null,null,null,null,null,null,null,null,null,null,null,null,null,"Raw Count Date:",null,null,null,null,null,null,null,null,null,null,null,null,null,null,null,null,null,null,null,null,null,{"$f":"\"local_od_raw_\"&BF59","v":"local_od_raw_1"},1,2,3,4,"est","tgt","err"]
[null,null,null,null,null,null,null,null,null,null,null,null,null,null,null,null,null,null,null,null,null,null,null,null,null,null,null,null,null,null,null,null,null,null,null,null,null,null,null,null,null,null,null,null,null,null,null,null,null,null,null,null,null,null,null,null,null,null,null,null,null,null,null,null,null,null,1,{"$f":"BG61","v":0},{"$f":"BJ61","v":39},{"$f":"BI61","v":480},{"$f":"BH61","v":469},{"$f":"SUM(BP47:BS47)","v":988},{"$f":"BI76","v":988},{"$f":"IFERROR(ABS(BT47-BU47)/BU47,0)","v":0}]
[null,null,null,null,null,null,null,null,null,null,null,null,null,null,null,null,null,null,null,null,null,null,null,null,null,null,null,null,null,null,null,null,null,null,null,null,null,null,null,null,null,null,null,null,null,null,null,null,null,null,null,null,null,null,null,null,"Default St",null,null,null,null,null,null,null,null,null,2,{"$f":"BH57","v":402},{"$f":"BH58","v":0},{"$f":"BH55","v":102},{"$f":"BH56","v":361},{"$f":"SUM(BP48:BS48)","v":865},{"$f":"BW56","v":865},{"$f":"IFERROR(ABS(BT48-BU48)/BU48,0)","v":0}]
[null,null,null,null,null,null,null,null,null,null,null,null,null,null,null,null,null,null,null,null,null,null,null,null,null,null,null,null,null,null,null,null,null,null,null,null,null,null,null,null,null,null,null,null,null,null,null,null,null,null,null,null,null,"",null,null,null,null,null,null,null,null,null,null,null,null,3,{"$f":"BC57","v":212},{"$f":"BD57","v":415},{"$f":"BE57","v":0},{"$f":"BB57","v":389},{"$f":"SUM(BP49:BS49)","v":1016},{"$f":"BC42","v":1016},0]
[null,null,null,null,null,null,null,null,null,null,null,null,null,null,null,null,null,null,null,null,null,null,null,null,null,null,null,null,null,null,null,null,null,null,null,null,null,null,null,null,null,null,null,null,null,null,null,null,null,null,null,null,null,null,null,null,null,null,null,null,null,null,null,null,null,null,4,{"$f":"BD63","v":191},{"$f":"BD62","v":407},{"$f":"BD61","v":212},{"$f":"BD60","v":0},{"$f":"SUM(BP50:BS50)","v":810},{"$f":"AO62","v":810},0]
[null,null,null,null,null,null,null,null,null,null,null,null,null,null,null,null,null,null,null,null,null,null,null,null,null,null,null,null,null,null,null,null,null,null,null,null,null,null,null,null,null,null,null,null,null,null,null,null,null,null,null,null,null,null,null,null,null,null,null,null,null,null,null,null,null,null,"est",{"$f":"SUM(BP47:BP50)","v":805},{"$f":"SUM(BQ47:BQ50)","v":861},{"$f":"SUM(BR47:BR50)","v":794},{"$f":"SUM(BS47:BS50)","v":1219}]
[null,null,null,null,null,null,null,null,null,null,null,null,null,null,null,null,null,null,null,null,null,null,null,null,null,null,null,null,null,null,null,null,null,null,null,null,null,null,null,null,null,null,null,null,null,null,null,null,null,null,null,null,"RNSE",{"$f":"RNSE(BB54,BB57)","v":0},{"$f":"RNSE(BC54,BC57)","v":0},0,"-",null,null,null,null,null,null,null,null,null,"tgt",{"$f":"BC74","v":805},{"$f":"BU62","v":861},{"$f":"BI44","v":794},{"$f":"AQ56","v":1219}]
[null,null,null,null,null,null,null,null,null,null,null,null,null,null,null,null,null,null,null,null,null,null,null,null,null,null,null,null,null,null,null,null,null,null,null,null,null,null,null,null,null,null,null,null,null,null,null,null,null,null,null,null,"%",{"$f":"BB54/BD42","v":0.38287401574803148},{"$f":"BC54/BD42","v":0.20866141732283464},{"$f":"BD54/BD42","v":0.40846456692913385},{"$f":"BE54/BD42","v":0},null,null,null,null,null,null,null,null,null,"err",{"$f":"IFERROR(ABS(BP51-BP52)/BP52,0)","v":0},{"$f":"IFERROR(ABS(BQ51-BQ52)/BQ52,0)","v":0},0,0,null,null,{"$f":"SUM(BP53:BS53,BV47:BV50)","v":0}]
[null,null,null,null,null,null,null,null,null,null,null,null,null,null,null,null,null,null,null,null,null,null,null,null,null,null,null,null,null,null,null,null,null,null,null,null,null,null,null,null,null,null,null,null,null,null,null,null,null,null,null,null,"bal",{"$f":"BS68","v":389},{"$f":"BP68","v":212},{"$f":"BQ68","v":415},{"$f":"BR68","v":0},null,null,"raw","%",null,"bal","%","RNSE"]
[null,null,null,null,null,null,null,null,null,null,null,null,null,null,null,null,null,null,null,null,null,null,null,null,null,null,null,null,null,null,null,null,null,null,null,null,null,null,null,null,null,null,null,null,null,null,null,null,null,null,null,null,null,8,"$",9,"M",null,{"$f":"CHOOSE(1,\"<\",\"TURN\",6,BF59,BH55,BK55)","v":"<"},{"$f":"RANDBETWEEN(10,500)","v":102},{"$f":"BH55/BW58","v":0.11791907514450867},"<",{"$f":"BR67","v":102},{"$f":"BK55/BW57","v":0.11791907514450867},{"$f":"RNSE(BK55,BH55)","v":0},null,null,""]
[null,null,null,null,null,null,null,null,null,null,null,null,null,null,null,null,null,null,null,null,null,null,null,null,null,null,null,null,null,null,null,null,null,null,null,null,null,null,null,null,"imbal","target",{"$f":"IF(AN57<>\"\",AVERAGE(AQ57,AN57),AQ57)","v":1219},null,null,null,null,null,null,null,null,null,"%",{"$f":"BB57/BE42","v":0.38287401574803148},{"$f":"BC57/BE42","v":0.20866141732283464},{"$f":"BD57/BE42","v":0.40846456692913385},{"$f":"BE57/BE42","v":0},null,{"$f":"CHOOSE(1,\"!\",\"TURN\",5,BF59,BH56,BK56)","v":"!"},361,{"$f":"BH56/BW58","v":0.41734104046242776},"!",{"$f":"BS67","v":361},{"$f":"BK56/BW57","v":0.41734104046242776},{"$f":"RNSE(BK56,BH56)","v":0},null,null,null,null,null,null,null,null,"target",{"$f":"IF(BZ57<>\"\",AVERAGE(BW57,BZ57),BW57)","v":865}]
[null,null,null,null,null,null,null,null,null,null,null,null,null,null,null,null,null,null,null,null,null,null,null,null,null,null,null,null,null,null,null,null,null,null,null,null,null,null,null,null,{"$f":"IF(AN57<>\"\",AN57-AQ57,0)","v":0},"!",{"$f":"SUM(BA60,BH64,BK56,BB54)","v":1219},null,null,null,null,null,null,null,null,null,"raw",{"$f":"RANDBETWEEN(10,500)","v":389},212,415,0,null,{"$f":"CHOOSE(1,\">\",\"TURN\",4,BF59,BH57,BK57)","v":">"},402,{"$f":"BH57/BW58","v":0.46473988439306357},">",{"$f":"BP67","v":402},{"$f":"BK57/BW57","v":0.46473988439306357},0,null,null,null,null,null,null,null,null,"!",{"$f":"SUM(BK55:BK58)","v":865}]
[null,null,null,null,null,null,null,null,null,null,null,null,null,null,null,null,null,null,null,null,null,null,null,null,null,null,null,null,null,null,null,null,null,null,null,null,null,null,null,null,{"$f":"IF(AN58<>\"\",AN58-AQ58,0)","v":0},"!",{"$f":"SUM(BD60,BH61,BH56,BB57)","v":1219},null,null,null,null,null,null,null,null,null,null,{"$f":"CHOOSE(1,8,\"TURN\",9,BF59,BB57,BB54)","v":8},{"$f":"CHOOSE(1,\"$\",\"TURN\",8,BF59,BC57,BC54)","v":"$"},{"$f":"CHOOSE(1,\"9\",\"TURN\",7,BF59,BD57,BD54)","v":"9"},{"$f":"CHOOSE(1,\"M\",\"TURN\",15,BF59,BE57,BE54)","v":"M"},null,{"$f":"CHOOSE(1,\"N\",\"TURN\",14,BF59,BH58,BK58)","v":"N"},0,{"$f":"BH58/BW58","v":0},"N",{"$f":"BQ67","v":0},{"$f":"BK58/BW57","v":0},"-",null,null,null,null,null,null,null,null,"!",{"$f":"SUM(BH55:BH58)","v":865}]
[null,null,null,null,null,null,null,null,null,null,null,null,null,null,null,null,null,null,null,null,null,null,null,null,null,null,null,null,null,null,null,null,null,null,null,null,null,null,null,null,null,null,null,null,null,null,null,null,null,null,null,null,null,null,null,null,null,1]
[null,null,null,null,null,null,null,null,null,null,null,null,null,null,null,null,null,null,null,null,null,null,null,null,null,null,null,null,null,null,null,null,null,null,null,null,null,null,null,null,{"$f":"SUM(BD60:BD63)","v":810},"\"",null,null,null,null,null,null,"Main Ave",null,{"$f":"RNSE(BA60,BD60)","v":"-"},{"$f":"BA60/AO61","v":0},{"$f":"BS69","v":0},"O",{"$f":"BD60/AO60","v":0},0,{"$f":"CHOOSE(1,\"O\",\"TURN\",16,BF59,BD60,BA60)","v":"O"},null,{"$f":"CHOOSE(1,\"L\",\"TURN\",13,BF59,BG61,BG64)","v":"L"},{"$f":"CHOOSE(1,\":\",\"TURN\",1,BF59,BH61,BH64)","v":":"},{"$f":"CHOOSE(1,\"#\",\"TURN\",2,BF59,BI61,BI64)","v":"#"},{"$f":"CHOOSE(1,\";\",\"TURN\",3,BF59,BJ61,BJ64)","v":";"},null,null,null,null,null,null,null,null,null,null,{"$f":"SUM(BH58,BD57,BD62,BJ61)","v":861},"\"",{"$f":"IF(BX60<>\"\",BX60-BU60,0)","v":0}]
{"$rows_left_out":17}
{"sheet":"How-To (with Freeway Link)","index":1,"n_rows":101,"n_cols":69,"rows_kept":101,"cut":false,"hidden":false,"merged":[]}
[]
[]
[]
[]
[]
[]
[]
[]
[]
[]
[]
[]
[]
[]
[]
[]
[]
[]
[]
[]
[]
[]
[]
[]
[]
[]
[]
[]
[]
[]
[]
[]
[]
[]
[]
[]
[]
[]
[]
[]
[]
[]
[]
[]
[]
[]
[]
[]
[]
[]
[]
[null,null,null,null,null,null,null,null,null,null,null,null,null,null,null,null,null,null,null,null,null,null,null,null,null,null,null,null,null,{"$f":"CHOOSE(1,AK77&\":\",\"IX_NAME\",AE52)","v":"1:"},"Default St & SB I-999 Ramps",null,null,null,null,null,null,null,null,null,null,null,null,null,null,null,null,null,null,null,null,null,null,null,null,null,null,{"$f":"CHOOSE(1,BF77&\":\",\"IX_NAME\",BG52)","v":"2:"},"Default St & NB I-999 Ramps"]
[null,null,null,null,null,null,null,null,null,null,null,null,null,null,null,null,null,null,null,null,null,null,null,null,null,null,null,null,null,null,"Raw Count Date:",null,null,null,null,null,null,null,null,null,null,null,null,null,null,null,null,null,null,null,null,null,null,null,null,null,null,null,"Raw Count Date:"]
[null,null,null,null,null,null,null,null,null,null,null,null,null,null,null,null,null,null,null,null,null,null,null,null,null,"Local OD Raw",null,null,null,null,null,null,null,null,null,null,null,null,null,null,null,null,null,null,null,null,null,null,null,null,null,null,null,null,null,null,null,null,null,null,null,"Local OD Raw"]
[null,null,null,null,null,null,null,null,null,null,null,null,null,null,null,null,null,null,null,null,null,null,null,null,null,{"$f":"\"local_od_raw_\"&AK77","v":"local_od_raw_1"},1,2,3,4,"est","tgt","err",null,null,null,null,null,null,null,null,null,null,null,null,null,null,null,null,null,null,null,null,null,null,null,null,null,null,null,null,{"$f":"\"local_od_raw_\"&BF77","v":"local_od_raw_2"},1,2,3,4,"est","tgt","err"]
[null,null,null,null,null,null,null,null,null,null,null,null,null,null,null,null,null,null,null,null,null,null,null,null,null,1,0,0,0,0,{"$f":"SUM(AA56:AD56)","v":0},0,{"$f":"IFERROR(ABS(AE56-AF56)/AF56,0)","v":0},null,null,null,null,null,null,null,null,null,null,null,null,null,null,null,null,null,null,null,null,null,null,null,null,null,null,null,null,1,0,{"$f":"BI79","v":340},{"$f":"BH79","v":0},{"$f":"BG79","v":302},{"$f":"SUM(BK56:BN56)","v":642},{"$f":"BI88","v":280},{"$f":"IFERROR(ABS(BO56-BP56)/BP56,0)","v":1.2928571428571429}]
[null,null,null,null,null,null,null,null,null,null,null,null,null,null,null,null,null,null,null,null,null,null,null,null,null,2,{"$f":"AM75","v":109},{"$f":"AM76","v":0},0,{"$f":"AM74","v":68},{"$f":"SUM(AA57:AD57)","v":177},{"$f":"AU74","v":357.5},{"$f":"IFERROR(ABS(AE57-AF57)/AF57,0)","v":0.50489510489510492},null,null,null,null,null,null,null,null,null,null,null,null,null,null,null,null,null,null,null,null,null,null,null,null,null,null,null,null,2,0,{"$f":"BH76","v":0},{"$f":"BH74","v":243},{"$f":"BH75","v":236},{"$f":"SUM(BK57:BN57)","v":479},{"$f":"BQ74","v":479},{"$f":"IFERROR(ABS(BO57-BP57)/BP57,0)","v":0}]
[null,null,null,null,null,null,null,null,null,null,null,null,null,null,null,null,null,null,null,null,null,null,null,null,null,3,{"$f":"AI75","v":0},{"$f":"AJ75","v":456},0,{"$f":"AH75","v":273},{"$f":"SUM(AA58:AD58)","v":729},{"$f":"AH66","v":200},2.645,null,null,null,null,null,null,null,null,null,null,null,null,null,null,null,null,null,null,null,null,null,null,null,null,null,null,null,null,3,0,0,0,0,{"$f":"SUM(BK58:BN58)","v":0},0,0]
[null,null,null,null,null,null,null,null,null,null,null,null,null,null,null,null,null,null,null,null,null,null,null,null,null,4,{"$f":"AI80","v":220},{"$f":"AI79","v":379},0,{"$f":"AI78","v":0},{"$f":"SUM(AA59:AD59)","v":599},{"$f":"Z80","v":599},0,null,null,null,null,null,null,null,null,null,null,null,null,null,null,null,null,null,null,null,null,null,null,null,null,null,null,null,null,4,0,{"$f":"BD80","v":360},{"$f":"BD79","v":470},{"$f":"BD78","v":0},{"$f":"SUM(BK59:BN59)","v":830},{"$f":"AV80","v":832.5},3.003003003003003E-3]
[null,null,null,null,null,null,null,null,null,null,null,null,null,null,null,null,null,null,null,null,null,null,null,null,null,"est",{"$f":"SUM(AA56:AA59)","v":329},{"$f":"SUM(AB56:AB59)","v":835},{"$f":"SUM(AC56:AC59)","v":0},{"$f":"SUM(AD56:AD59)","v":341},null,null,null,null,null,null,null,null,null,null,null,null,null,null,null,null,null,null,null,null,null,null,null,null,null,null,null,null,null,null,null,"est",{"$f":"SUM(BK56:BK59)","v":0},{"$f":"SUM(BL56:BL59)","v":700},{"$f":"SUM(BM56:BM59)","v":713},{"$f":"SUM(BN56:BN59)","v":538}]
{"$rows_left_out":41}