{"text_format":"1","workbook":"xlsx","n_sheets":6,"sheets":["Corridor","Raw-Initial Volumes","Balancing","Diagnostics","Export To Intersection Balancer","Data Validation"],"not_rendered":{"charts":0,"images":1,"macros":1,"external_links":0,"defined_names":120,"comments":3,"pivot_tables":0},"unopened":[],"bounds":{"document_bytes":16777216,"sheet_cells":100000,"rows_first":2000,"rows_last":500,"rows_between":2000,"halvings":0,"cell_chars":16384,"cell_head_chars":4096},"cells_cut":0,"cells_raw":0,"read":"whole","date_system":"1900"}

{"sheet":"Corridor","index":0,"n_rows":98,"n_cols":10,"rows_kept":98,"cut":false,"hidden":false,"merged":[]}
[null,null,null,"Project","Example 2 for Freeway Balancing"]
[null,null,null,"Scenario","Year 2012 AM Peak"]
[]
[null,null,null,"Location Information"]
[]
[null,null,null,"Corridor","Corridor & Direction","Link ID","Affects 2+\nCorridors?","# of Lanes","Type","Location"]
[null,null,null,"NB I-39/90","NB I-39/90",1000,null,3,"mainline","Beltline I/C to Badger I/C"]
[null,null,null,null,"NB I-39/90",1010,"Primary",1,"off","off to WB WIS 30"]
[null,null,null,null,"NB I-39/90",1020,"Primary",1,"off","off to EB I-94"]
[null,null,null,null,"NB I-39/90",1030,null,3,"mainline.","b/n ramps"]
[null,null,null,null,"NB I-39/90",1040,"Primary",1,"on","on from EB WIS 30"]
[null,null,null,null,"NB I-39/90",1050,"Primary",2,"on","on from WB I-94"]
[null,null,null,null,"NB I-39/90",1060,null,4,"mainline","Badger to US 151"]
[null,null,null,null,"NB I-39/90",1070,null,2,"CD","off to US 151/High Crossing CD"]
[null,null,null,null,"NB I-39/90",1080,null,1,"off","CD: off to High Crossing"]
[null,null,null,null,"NB I-39/90",1090,"Primary",1,"off","CD: off to NB US 151"]
[null,null,null,null,"NB I-39/90",1100,null,1,"CD","CD: b/n ramps"]
[null,null,null,null,"NB I-39/90",1110,"Primary",1,"on","CD: on from NB US 151"]
[null,null,null,null,"NB I-39/90",1120,"Primary",1,"off","CD: off to SB US 151"]
[null,null,null,null,"NB I-39/90",1130,null,1,"CD","CD: b/n ramps"]
{"$rows_left_out":79}
{"sheet":"Raw-Initial Volumes","index":1,"n_rows":101,"n_cols":38,"rows_kept":101,"cut":false,"hidden":false,"merged":[[5,36,5,37]]}
[null,null,null,"Project",{"$f":"project_name","v":"Example 2 for Freeway Balancing"}]
[null,null,null,"Scenario",{"$f":"scenario_name","v":"Year 2012 AM Peak"}]
[]
[]
[]
[null,null,null,"Location Information",null,null,null,null,null,null,"Raw/Initial Traffic Volumes",null,null,null,null,null,null,null,null,null,null,null,null,null,null,null,null,null,null,null,null,null,null,null,null,null,"Initial Input to Volume Balancing"]
[null,null,null,null,null,null,null,null,null,null,"AADT",null,null,null,null,null,"ATR",null,null,null,"V-SPOC",null,null,null,"Tube Count 1",null,null,null,"Tube Count 2",null,null,null,"Turning Movement Count"]
[]
[null,null,"SORT","Corridor","Corridor & Direction","Link ID","Affects 2+\nCorridors?","# of Lanes","Type","Location","TRADAS ID","Year","AADT","K-factor","Hourly Volume","Comments","Date","Hour","Volume","Comments","Date","Hour","Volume","Comments","Date","Hour","Volume","Comments","Date","Hour","Volume","Comments","Date","Hour","Volume","Comments","Source / Comments","Raw\nVolume"]
[null,null,1,"NB I-39/90","NB I-39/90",1000,null,3,"mainline","Beltline I/C to Badger I/C",130004,null,null,null,null,null,"2012-08-10","07:00:00",3710,null,"2012-08-10","07:00:00",3669,null,null,null,null,null,null,null,null,null,null,null,null,null,"ATR",{"$f":"S10","v":3710}]
[null,null,2,null,"NB I-39/90",1010,"Primary",1,"off","off to WB WIS 30",null,null,null,null,null,null,null,null,null,null,null,null,null,null,"2010-03-01","07:00:00",504,null,null,null,null,null,null,null,null,null,"Tube",{"$f":"AA11","v":504}]
[null,null,3,null,"NB I-39/90",1020,"Primary",1,"off","off to EB I-94",null,null,null,null,null,null,null,null,null,null,null,null,null,null,"2010-03-01","07:00:00",409,null,null,null,null,null,null,null,null,null,"Tube",{"$f":"AA12","v":409}]
[null,null,4,null,"NB I-39/90",1030,null,3,"mainline.","b/n ramps"]
[null,null,5,null,"NB I-39/90",1040,"Primary",1,"on","on from EB WIS 30",null,null,null,null,null,null,null,null,null,null,null,null,null,null,"2010-03-01","07:00:00",441,null,null,null,null,null,null,null,null,null,"Tube",{"$f":"AA14","v":441}]
[null,null,6,null,"NB I-39/90",1050,"Primary",2,"on","on from WB I-94",null,null,null,null,null,null,null,null,null,null,null,null,null,null,"2010-03-01","07:00:00",787,null,null,null,null,null,null,null,null,null,"Tube",{"$f":"AA15","v":787}]
[null,null,7,null,"NB I-39/90",1060,null,4,"mainline","Badger to US 151",null,null,null,null,null,null,"2012-08-10","07:00:00",null,null,"2012-08-10","07:00:00",3768]
[null,null,8,null,"NB I-39/90",1070,null,2,"CD","off to US 151/High Crossing CD",null,null,null,null,null,null,null,null,null,null,"2012-08-10","07:00:00",1843,null,null,null,null,null,null,null,null,null,null,null,null,null,"V-SPOC",{"$f":"W17","v":1843}]
[null,null,9,null,"NB I-39/90",1080,null,1,"off","CD: off to High Crossing",null,null,null,null,null,null,null,null,null,null,null,null,null,null,"2010-04-05","07:00:00",541,null,null,null,null,null,"2012-05-05","07:00:00",535,null,"TM Count",{"$f":"AA18","v":541}]
[null,null,10,null,"NB I-39/90",1090,"Primary",1,"off","CD: off to NB US 151",null,null,null,null,null,null,null,null,null,null,"2012-08-10","07:00:00",1469,null,"2010-04-05","07:00:00",1627,null,null,null,null,null,null,null,null,null,"V-SPOC",{"$f":"W19","v":1469}]
[null,null,11,null,"NB I-39/90",1100,null,1,"CD","CD: b/n ramps"]
{"$rows_left_out":82}
{"sheet":"Balancing","index":2,"n_rows":102,"n_cols":29,"rows_kept":102,"cut":false,"hidden":false,"merged":[[6,11,7,11],[6,20,7,20],[6,9,8,10]]}
[null,"*** Do not sort this worksheet***",null,null,null,null,null,null,"Green highlighted cells demonstrate user inputs.  See the notes on each highlighted cell for more info"]
[null,"Filtering is ok, but sorting may cause errors in the Solver volumes, cumulative sums, and potentially the FINAL volumes."]
[null,"Use the Diagnostics sheet for sorting data."]
[null,"Location Information",null,null,null,null,null,null,"Balancing"]
[null,"Project",{"$f":"project_name","v":"Example 2 for Freeway Balancing"},null,null,null,null,null,"User Inputs - Volumes",null,null,null,"Raw vs Balanced Comparison",null,null,"User Inputs - Solver",null,null,"Solver Objective & Penalty Functions"]
[null,"Scenario",{"$f":"scenario_name","v":"Year 2012 AM Peak"},null,null,null,null,null,null,null,null,null,"Also shown on \"Diagnostics\" worksheet",null,null,null,null,null,{"$f":"total_wRNSE*W8+sd_wRNSE*X8+total_wLargeRNSE*Y8+total_fixedPenalty","v":3},"Solver Objective",null,null,null,"Large RNSE Penalty Threshold",3,null,null,null,"Check for Blank Cells (show warning)"]
[null,null,null,null,null,null,null,null,null,"Selected Raw/Initial Count used to start balancing",null,"Volume Type",null,null,null,null,null,null,null,null,"Network Weight","Normalization Factors",117.72099595966962,2.4868788828647284,0.14107937359016848,null,null,null,true]
[null,null,null,null,null,null,null,null,null,null,null,null,null,null,null,null,null,null,null,null,null,"theta:",{"$f":"1/MAX(normFactor_wRNSE, 0.1)","v":8.4946613970424863E-3},{"$f":"1/MAX(normFactor_SD, 0.1)","v":0.40211045535440904},{"$f":"1/MAX(normFactor_wLargeRNSE, 0.1)","v":7.0882083932763358},null,null,null,"First Solver Run?"]
[null,null,null,null,null,null,null,null,null,null,null,"Hourly","Totals",{"$f":"SUM($N11:$N102)","v":105.15896025213515},null,null,null,null,null,null,{"$f":"SUM($U11:$U102)","v":16.308000000000003},null,{"$f":"SUM($W11:$W102)","v":117.72099595966962},{"$f":"_xlfn.STDEV.P($W11:$W102)","v":2.4868788828647284},{"$f":"SUM($Y11:$Y102)","v":0.14107937359016848},{"$f":"SUM($Z11:$Z102)","v":0},null,null,false]
[null,"Corridor","Corridor & Direction","Link ID","Affects 2+\nCorridors?","# of Lanes","Location\nType","Location","Ramp\nSign","Source / Comments","Raw/Initial\nVolume","FINAL Balanced Volumes","Diff","RNSE","Comments","Include as a Solver Variable?","Fixed Anchor","Weight Adjustment","Global Weight\nRank","Capacity Weight","Weight Product\n(Cap. * Adj.)","Global Weight","Weighted RNSE Penalty","Weighted SD Penalty","Weighted Large RNSE Penalty","Fixed Anchor Penalty",null,null,"DO NOT USE OR DELETE THIS COLUMN"]
[null,"NB I-39/90","NB I-39/90",1000,null,3,"mainline","Beltline I/C to Badger I/C",null,{"$f":"IF($K11>0,INDEX('Raw-Initial Volumes'!$AK$10:$AK$101,MATCH($D11,'Raw-Initial Volumes'!$F$10:$F$101,0)),\"\")","v":"ATR"},{"$f":"INDEX('Raw-Initial Volumes'!$AL$10:$AL$101,MATCH($D11,'Raw-Initial Volumes'!$F$10:$F$101,0))","v":3710},{"$f":"3610","v":3610},{"$f":"IF(K11>0,L11-K11,0)","v":-100},{"$f":"IF(K11>0,SQRT(M11^2/K11),0)","v":1.6417727582577963},null,true,null,2,{"$f":"IF(NOT($Q11=\"Fixed\"),1+SUMPRODUCT(NOT($Q$11:$Q$102=\"Fixed\")*($V$11:$V$102>$V11)),\"\")","v":1},{"$f":"Capacity_Weight(K11/F11,capweight_scale)","v":0.6183333333333334},{"$f":"T11*R11*IF(E11=\"Secondary\",0,1)","v":1.2366666666666668},{"$f":"U11/network_weight*100","v":7.5831902542719307},{"$f":"N11*V11","v":12.449875180149668},null,{"$f":"V11*MAX(N11-$Y$6,0)^2","v":0},{"$f":"IF(Q11=\"Fixed\",999*(L11-K11)^2,0)","v":0}]
[null,null,"NB I-39/90",1010,"Primary",1,"off","off to WB WIS 30",-1,{"$f":"IF($K12>0,INDEX('Raw-Initial Volumes'!$AK$10:$AK$101,MATCH($D12,'Raw-Initial Volumes'!$F$10:$F$101,0)),\"\")","v":"Tube"},{"$f":"INDEX('Raw-Initial Volumes'!$AL$10:$AL$101,MATCH($D12,'Raw-Initial Volumes'!$F$10:$F$101,0))","v":504},{"$f":"570","v":570},66,2.939873661036668,null,true,null,1,24,0.252,0.252,1.5452538631346575,4.5428511318447402,null,0,0]
[null,null,"NB I-39/90",1020,"Primary",1,"off","off to EB I-94",-1,{"$f":"IF($K13>0,INDEX('Raw-Initial Volumes'!$AK$10:$AK$101,MATCH($D13,'Raw-Initial Volumes'!$F$10:$F$101,0)),\"\")","v":"Tube"},{"$f":"INDEX('Raw-Initial Volumes'!$AL$10:$AL$101,MATCH($D13,'Raw-Initial Volumes'!$F$10:$F$101,0))","v":409},{"$f":"470","v":470},61,3.0162558762483074,null,true,null,1,29,0.20449999999999999,0.20449999999999999,1.2539857738533233,3.7823419591168674,null,3.3137014549152599E-4,0]
[null,null,"NB I-39/90",1030,null,3,"mainline.","b/n ramps",null,{"$f":"IF($K14>0,INDEX('Raw-Initial Volumes'!$AK$10:$AK$101,MATCH($D14,'Raw-Initial Volumes'!$F$10:$F$101,0)),\"\")","v":""},{"$f":"INDEX('Raw-Initial Volumes'!$AL$10:$AL$101,MATCH($D14,'Raw-Initial Volumes'!$F$10:$F$101,0))","v":0},{"$f":"L$11+SUMPRODUCT(L$12:L13,$I$12:$I13)","v":2570},0,0,null,null,null,1,54,0,0,0,0,null,0,0]
[null,null,"NB I-39/90",1040,"Primary",1,"on","on from EB WIS 30",1,{"$f":"IF($K15>0,INDEX('Raw-Initial Volumes'!$AK$10:$AK$101,MATCH($D15,'Raw-Initial Volumes'!$F$10:$F$101,0)),\"\")","v":"Tube"},{"$f":"INDEX('Raw-Initial Volumes'!$AL$10:$AL$101,MATCH($D15,'Raw-Initial Volumes'!$F$10:$F$101,0))","v":441},{"$f":"380","v":380},-61,2.9047619047619047,null,true,null,1,28,0.2205,0.2205,1.3520971302428253,3.9275202354672545,null,0,0]
[null,null,"NB I-39/90",1050,"Primary",2,"on","on from WB I-94",1,{"$f":"IF($K16>0,INDEX('Raw-Initial Volumes'!$AK$10:$AK$101,MATCH($D16,'Raw-Initial Volumes'!$F$10:$F$101,0)),\"\")","v":"Tube"},{"$f":"INDEX('Raw-Initial Volumes'!$AL$10:$AL$101,MATCH($D16,'Raw-Initial Volumes'!$F$10:$F$101,0))","v":787},{"$f":"700","v":700},-87,3.1012150752279082,null,true,null,1,30,0.19674999999999998,0.19674999999999998,1.2064630856021581,3.7415015087753911,null,1.2359600769283179E-2,0]
[null,null,"NB I-39/90",1060,null,4,"mainline","Badger to US 151",null,{"$f":"IF($K17>0,INDEX('Raw-Initial Volumes'!$AK$10:$AK$101,MATCH($D17,'Raw-Initial Volumes'!$F$10:$F$101,0)),\"\")","v":""},{"$f":"INDEX('Raw-Initial Volumes'!$AL$10:$AL$101,MATCH($D17,'Raw-Initial Volumes'!$F$10:$F$101,0))","v":0},{"$f":"L$11+SUMPRODUCT(L$12:L16,$I$12:$I16)","v":3650},0,0,null,null,null,1,54,0,0,0,0,null,0,0]
[null,null,"NB I-39/90",1070,null,2,"CD","off to US 151/High Crossing CD",null,{"$f":"IF($K18>0,INDEX('Raw-Initial Volumes'!$AK$10:$AK$101,MATCH($D18,'Raw-Initial Volumes'!$F$10:$F$101,0)),\"\")","v":"V-SPOC"},{"$f":"INDEX('Raw-Initial Volumes'!$AL$10:$AL$101,MATCH($D18,'Raw-Initial Volumes'!$F$10:$F$101,0))","v":1843},{"$f":"SUM(L19:L20,L23)","v":1970},127,2.9582920972062303,null,null,null,1,11,0.46074999999999999,0.46074999999999999,2.825300466028942,8.3580640408864983,null,0,0]
[null,null,"NB I-39/90",1080,null,1,"off","CD: off to High Crossing",-1,{"$f":"IF($K19>0,INDEX('Raw-Initial Volumes'!$AK$10:$AK$101,MATCH($D19,'Raw-Initial Volumes'!$F$10:$F$101,0)),\"\")","v":"TM Count"},{"$f":"INDEX('Raw-Initial Volumes'!$AL$10:$AL$101,MATCH($D19,'Raw-Initial Volumes'!$F$10:$F$101,0))","v":541},{"$f":"470","v":470},-71,3.0525284207856691,null,true,null,1,22,0.27050000000000002,0.27050000000000002,1.6586951189600192,5.0632139920439245,null,4.5767296103686704E-3,0]
[null,null,"NB I-39/90",1090,"Primary",1,"off","CD: off to NB US 151",-1,{"$f":"IF($K20>0,INDEX('Raw-Initial Volumes'!$AK$10:$AK$101,MATCH($D20,'Raw-Initial Volumes'!$F$10:$F$101,0)),\"\")","v":"V-SPOC"},{"$f":"INDEX('Raw-Initial Volumes'!$AL$10:$AL$101,MATCH($D20,'Raw-Initial Volumes'!$F$10:$F$101,0))","v":1469},{"$f":"1380","v":1380},-89,2.3220903237706949,null,true,null,1,4,0.73450000000000004,0.73450000000000004,4.5039244542555794,10.458519394221089,null,0,0]
{"$rows_left_out":83}
{"sheet":"Diagnostics","index":3,"n_rows":99,"n_cols":22,"rows_kept":99,"cut":false,"hidden":false,"merged":[]}
[]
[null,null,null,"Project",{"$f":"project_name","v":"Example 2 for Freeway Balancing"}]
[null,null,null,"Scenario",{"$f":"scenario_name","v":"Year 2012 AM Peak"}]
[]
[null,null,null,"Location Information",null,null,null,null,null,null,"Raw vs Balanced Comparison",null,null,null,null,null,"Solver Diagnostics"]
[]
[null,null,"SORT","Corridor","Corridor & Direction","Link ID","Affects 2+\nCorridors?","# of Lanes","Type","Location","Raw Source / Comments","Raw","Balanced\nFINAL","Diff","RNSE","Comments","Solver Inputs","Input Global Weight","Input Global Weight\nRank","Solver Outputs","Final vs Solver Outputs","First Run Formula"]
[null,null,1,"NB I-39/90","NB I-39/90",1000,null,3,"mainline","Beltline I/C to Badger I/C",{"$f":"INDEX(Balancing!$J$11:$J$102,MATCH($F8,Balancing!$D$11:$D$102,0))","v":"ATR"},{"$f":"INDEX(Balancing!$K$11:$K$102,MATCH($F8,Balancing!$D$11:$D$102,0))","v":3710},{"$f":"INDEX(Balancing!$L$11:$L$102,MATCH($F8,Balancing!$D$11:$D$102,0))","v":3610},{"$f":"IF($L8>0,$M8-$L8,\"\")","v":-100},{"$f":"IF($L8>0,SQRT($N8^2/$L8),\"\")","v":1.6417727582577963},{"$f":"INDEX(Balancing!$O$11:$O$102,MATCH($F8,Balancing!$D$11:$D$102,0))","v":0},3650,{"$f":"INDEX(Balancing!$V$11:$V$102,MATCH($F8,Balancing!$D$11:$D$102,0))","v":7.5831902542719307},{"$f":"INDEX(Balancing!$S$11:$S$102,MATCH($F8,Balancing!$D$11:$D$102,0))","v":1},3610,{"$f":"M8-T8","v":0},"K11"]
[null,null,2,null,"NB I-39/90",1010,"Primary",1,"off","off to WB WIS 30",{"$f":"INDEX(Balancing!$J$11:$J$102,MATCH($F9,Balancing!$D$11:$D$102,0))","v":"Tube"},{"$f":"INDEX(Balancing!$K$11:$K$102,MATCH($F9,Balancing!$D$11:$D$102,0))","v":504},{"$f":"INDEX(Balancing!$L$11:$L$102,MATCH($F9,Balancing!$D$11:$D$102,0))","v":570},66,2.939873661036668,{"$f":"INDEX(Balancing!$O$11:$O$102,MATCH($F9,Balancing!$D$11:$D$102,0))","v":0},570,{"$f":"INDEX(Balancing!$V$11:$V$102,MATCH($F9,Balancing!$D$11:$D$102,0))","v":1.5452538631346575},{"$f":"INDEX(Balancing!$S$11:$S$102,MATCH($F9,Balancing!$D$11:$D$102,0))","v":24},570,0,"K12"]
[null,null,3,null,"NB I-39/90",1020,"Primary",1,"off","off to EB I-94",{"$f":"INDEX(Balancing!$J$11:$J$102,MATCH($F10,Balancing!$D$11:$D$102,0))","v":"Tube"},{"$f":"INDEX(Balancing!$K$11:$K$102,MATCH($F10,Balancing!$D$11:$D$102,0))","v":409},{"$f":"INDEX(Balancing!$L$11:$L$102,MATCH($F10,Balancing!$D$11:$D$102,0))","v":470},61,3.0162558762483074,{"$f":"INDEX(Balancing!$O$11:$O$102,MATCH($F10,Balancing!$D$11:$D$102,0))","v":0},470,{"$f":"INDEX(Balancing!$V$11:$V$102,MATCH($F10,Balancing!$D$11:$D$102,0))","v":1.2539857738533233},{"$f":"INDEX(Balancing!$S$11:$S$102,MATCH($F10,Balancing!$D$11:$D$102,0))","v":29},470,0,"K13"]
[null,null,4,null,"NB I-39/90",1030,null,3,"mainline.","b/n ramps",{"$f":"INDEX(Balancing!$J$11:$J$102,MATCH($F11,Balancing!$D$11:$D$102,0))","v":""},{"$f":"INDEX(Balancing!$K$11:$K$102,MATCH($F11,Balancing!$D$11:$D$102,0))","v":0},{"$f":"INDEX(Balancing!$L$11:$L$102,MATCH($F11,Balancing!$D$11:$D$102,0))","v":2570},"","",{"$f":"INDEX(Balancing!$O$11:$O$102,MATCH($F11,Balancing!$D$11:$D$102,0))","v":0},2610,{"$f":"INDEX(Balancing!$V$11:$V$102,MATCH($F11,Balancing!$D$11:$D$102,0))","v":0},{"$f":"INDEX(Balancing!$S$11:$S$102,MATCH($F11,Balancing!$D$11:$D$102,0))","v":54},2570,0,"L$11+SUMPRODUCT(L$12:L13,$I$12:$I13)"]
[null,null,5,null,"NB I-39/90",1040,"Primary",1,"on","on from EB WIS 30",{"$f":"INDEX(Balancing!$J$11:$J$102,MATCH($F12,Balancing!$D$11:$D$102,0))","v":"Tube"},{"$f":"INDEX(Balancing!$K$11:$K$102,MATCH($F12,Balancing!$D$11:$D$102,0))","v":441},{"$f":"INDEX(Balancing!$L$11:$L$102,MATCH($F12,Balancing!$D$11:$D$102,0))","v":380},-61,2.9047619047619047,{"$f":"INDEX(Balancing!$O$11:$O$102,MATCH($F12,Balancing!$D$11:$D$102,0))","v":0},380,{"$f":"INDEX(Balancing!$V$11:$V$102,MATCH($F12,Balancing!$D$11:$D$102,0))","v":1.3520971302428253},{"$f":"INDEX(Balancing!$S$11:$S$102,MATCH($F12,Balancing!$D$11:$D$102,0))","v":28},380,0,"K15"]
[null,null,6,null,"NB I-39/90",1050,"Primary",2,"on","on from WB I-94",{"$f":"INDEX(Balancing!$J$11:$J$102,MATCH($F13,Balancing!$D$11:$D$102,0))","v":"Tube"},{"$f":"INDEX(Balancing!$K$11:$K$102,MATCH($F13,Balancing!$D$11:$D$102,0))","v":787},{"$f":"INDEX(Balancing!$L$11:$L$102,MATCH($F13,Balancing!$D$11:$D$102,0))","v":700},-87,3.1012150752279082,{"$f":"INDEX(Balancing!$O$11:$O$102,MATCH($F13,Balancing!$D$11:$D$102,0))","v":0},700,{"$f":"INDEX(Balancing!$V$11:$V$102,MATCH($F13,Balancing!$D$11:$D$102,0))","v":1.2064630856021581},{"$f":"INDEX(Balancing!$S$11:$S$102,MATCH($F13,Balancing!$D$11:$D$102,0))","v":30},700,0,"K16"]
[null,null,7,null,"NB I-39/90",1060,null,4,"mainline","Badger to US 151",{"$f":"INDEX(Balancing!$J$11:$J$102,MATCH($F14,Balancing!$D$11:$D$102,0))","v":""},{"$f":"INDEX(Balancing!$K$11:$K$102,MATCH($F14,Balancing!$D$11:$D$102,0))","v":0},{"$f":"INDEX(Balancing!$L$11:$L$102,MATCH($F14,Balancing!$D$11:$D$102,0))","v":3650},"","",{"$f":"INDEX(Balancing!$O$11:$O$102,MATCH($F14,Balancing!$D$11:$D$102,0))","v":0},3690,{"$f":"INDEX(Balancing!$V$11:$V$102,MATCH($F14,Balancing!$D$11:$D$102,0))","v":0},{"$f":"INDEX(Balancing!$S$11:$S$102,MATCH($F14,Balancing!$D$11:$D$102,0))","v":54},3650,0,"L$11+SUMPRODUCT(L$12:L16,$I$12:$I16)"]
[null,null,8,null,"NB I-39/90",1070,null,2,"CD","off to US 151/High Crossing CD",{"$f":"INDEX(Balancing!$J$11:$J$102,MATCH($F15,Balancing!$D$11:$D$102,0))","v":"V-SPOC"},{"$f":"INDEX(Balancing!$K$11:$K$102,MATCH($F15,Balancing!$D$11:$D$102,0))","v":1843},{"$f":"INDEX(Balancing!$L$11:$L$102,MATCH($F15,Balancing!$D$11:$D$102,0))","v":1970},127,2.9582920972062303,{"$f":"INDEX(Balancing!$O$11:$O$102,MATCH($F15,Balancing!$D$11:$D$102,0))","v":0},1980,{"$f":"INDEX(Balancing!$V$11:$V$102,MATCH($F15,Balancing!$D$11:$D$102,0))","v":2.825300466028942},{"$f":"INDEX(Balancing!$S$11:$S$102,MATCH($F15,Balancing!$D$11:$D$102,0))","v":11},1970,0,"SUM(L19:L20,L23)"]
[null,null,9,null,"NB I-39/90",1080,null,1,"off","CD: off to High Crossing",{"$f":"INDEX(Balancing!$J$11:$J$102,MATCH($F16,Balancing!$D$11:$D$102,0))","v":"TM Count"},{"$f":"INDEX(Balancing!$K$11:$K$102,MATCH($F16,Balancing!$D$11:$D$102,0))","v":541},{"$f":"INDEX(Balancing!$L$11:$L$102,MATCH($F16,Balancing!$D$11:$D$102,0))","v":470},-71,3.0525284207856691,{"$f":"INDEX(Balancing!$O$11:$O$102,MATCH($F16,Balancing!$D$11:$D$102,0))","v":0},470,{"$f":"INDEX(Balancing!$V$11:$V$102,MATCH($F16,Balancing!$D$11:$D$102,0))","v":1.6586951189600192},{"$f":"INDEX(Balancing!$S$11:$S$102,MATCH($F16,Balancing!$D$11:$D$102,0))","v":22},470,0,"K19"]
[null,null,10,null,"NB I-39/90",1090,"Primary",1,"off","CD: off to NB US 151",{"$f":"INDEX(Balancing!$J$11:$J$102,MATCH($F17,Balancing!$D$11:$D$102,0))","v":"V-SPOC"},{"$f":"INDEX(Balancing!$K$11:$K$102,MATCH($F17,Balancing!$D$11:$D$102,0))","v":1469},{"$f":"INDEX(Balancing!$L$11:$L$102,MATCH($F17,Balancing!$D$11:$D$102,0))","v":1380},-89,2.3220903237706949,{"$f":"INDEX(Balancing!$O$11:$O$102,MATCH($F17,Balancing!$D$11:$D$102,0))","v":0},1400,{"$f":"INDEX(Balancing!$V$11:$V$102,MATCH($F17,Balancing!$D$11:$D$102,0))","v":4.5039244542555794},{"$f":"INDEX(Balancing!$S$11:$S$102,MATCH($F17,Balancing!$D$11:$D$102,0))","v":4},1380,0,"K20"]
[null,null,11,null,"NB I-39/90",1100,null,1,"CD","CD: b/n ramps",{"$f":"INDEX(Balancing!$J$11:$J$102,MATCH($F18,Balancing!$D$11:$D$102,0))","v":""},{"$f":"INDEX(Balancing!$K$11:$K$102,MATCH($F18,Balancing!$D$11:$D$102,0))","v":0},{"$f":"INDEX(Balancing!$L$11:$L$102,MATCH($F18,Balancing!$D$11:$D$102,0))","v":120},"","",{"$f":"INDEX(Balancing!$O$11:$O$102,MATCH($F18,Balancing!$D$11:$D$102,0))","v":0},110,{"$f":"INDEX(Balancing!$V$11:$V$102,MATCH($F18,Balancing!$D$11:$D$102,0))","v":0},{"$f":"INDEX(Balancing!$S$11:$S$102,MATCH($F18,Balancing!$D$11:$D$102,0))","v":54},120,0,"L18-L19-L20"]
[null,null,12,null,"NB I-39/90",1110,"Primary",1,"on","CD: on from NB US 151",{"$f":"INDEX(Balancing!$J$11:$J$102,MATCH($F19,Balancing!$D$11:$D$102,0))","v":"V-SPOC"},{"$f":"INDEX(Balancing!$K$11:$K$102,MATCH($F19,Balancing!$D$11:$D$102,0))","v":102},{"$f":"INDEX(Balancing!$L$11:$L$102,MATCH($F19,Balancing!$D$11:$D$102,0))","v":70},-32,3.1684721375253577,{"$f":"INDEX(Balancing!$O$11:$O$102,MATCH($F19,Balancing!$D$11:$D$102,0))","v":0},70,{"$f":"INDEX(Balancing!$V$11:$V$102,MATCH($F19,Balancing!$D$11:$D$102,0))","v":0.61319597743438792},{"$f":"INDEX(Balancing!$S$11:$S$102,MATCH($F19,Balancing!$D$11:$D$102,0))","v":42},70,0,"K22"]
[null,null,13,null,"NB I-39/90",1120,"Primary",1,"off","CD: off to SB US 151",{"$f":"INDEX(Balancing!$J$11:$J$102,MATCH($F20,Balancing!$D$11:$D$102,0))","v":"V-SPOC"},{"$f":"INDEX(Balancing!$K$11:$K$102,MATCH($F20,Balancing!$D$11:$D$102,0))","v":154},{"$f":"INDEX(Balancing!$L$11:$L$102,MATCH($F20,Balancing!$D$11:$D$102,0))","v":120},-34,2.7397980776862929,{"$f":"INDEX(Balancing!$O$11:$O$102,MATCH($F20,Balancing!$D$11:$D$102,0))","v":0},110,{"$f":"INDEX(Balancing!$V$11:$V$102,MATCH($F20,Balancing!$D$11:$D$102,0))","v":0.61319597743438792},{"$f":"INDEX(Balancing!$S$11:$S$102,MATCH($F20,Balancing!$D$11:$D$102,0))","v":42},120,0,"K23"]
{"$rows_left_out":80}
{"sheet":"Export To Intersection Balancer","index":4,"n_rows":98,"n_cols":9,"rows_kept":98,"cut":false,"hidden":false,"merged":[[4,3,4,8]]}
[]
[null,null,null,null,"Project",{"$f":"project_name","v":"Example 2 for Freeway Balancing"}]
[null,null,null,null,"Scenario",{"$f":"scenario_name","v":"Year 2012 AM Peak"}]
[]
[null,null,null,"Copy this Data to the Turning Movement Balancing Workbook"]
[null,null,"LINK_ID\n(no prefix)","LINK_ID","Corridor","Corridor & Direction","Type","Location","Balanced\nVolume"]
[null,null,1000,{"$f":"\"LINK_\" & $C7","v":"LINK_1000"},"NB I-39/90","NB I-39/90","mainline","Beltline I/C to Badger I/C",{"$f":"INDEX(Balancing!$L$11:$L$102,MATCH($C7,Balancing!$D$11:$D$102,0))","v":3610}]
[null,null,1010,"LINK_1010",null,"NB I-39/90","off","off to WB WIS 30",{"$f":"INDEX(Balancing!$L$11:$L$102,MATCH($C8,Balancing!$D$11:$D$102,0))","v":570}]
[null,null,1020,"LINK_1020",null,"NB I-39/90","off","off to EB I-94",{"$f":"INDEX(Balancing!$L$11:$L$102,MATCH($C9,Balancing!$D$11:$D$102,0))","v":470}]
[null,null,1030,"LINK_1030",null,"NB I-39/90","mainline.","b/n ramps",{"$f":"INDEX(Balancing!$L$11:$L$102,MATCH($C10,Balancing!$D$11:$D$102,0))","v":2570}]
[null,null,1040,"LINK_1040",null,"NB I-39/90","on","on from EB WIS 30",{"$f":"INDEX(Balancing!$L$11:$L$102,MATCH($C11,Balancing!$D$11:$D$102,0))","v":380}]
[null,null,1050,"LINK_1050",null,"NB I-39/90","on","on from WB I-94",{"$f":"INDEX(Balancing!$L$11:$L$102,MATCH($C12,Balancing!$D$11:$D$102,0))","v":700}]
[null,null,1060,"LINK_1060",null,"NB I-39/90","mainline","Badger to US 151",{"$f":"INDEX(Balancing!$L$11:$L$102,MATCH($C13,Balancing!$D$11:$D$102,0))","v":3650}]
[null,null,1070,"LINK_1070",null,"NB I-39/90","CD","off to US 151/High Crossing CD",{"$f":"INDEX(Balancing!$L$11:$L$102,MATCH($C14,Balancing!$D$11:$D$102,0))","v":1970}]
[null,null,1080,"LINK_1080",null,"NB I-39/90","off","CD: off to High Crossing",{"$f":"INDEX(Balancing!$L$11:$L$102,MATCH($C15,Balancing!$D$11:$D$102,0))","v":470}]
[null,null,1090,"LINK_1090",null,"NB I-39/90","off","CD: off to NB US 151",{"$f":"INDEX(Balancing!$L$11:$L$102,MATCH($C16,Balancing!$D$11:$D$102,0))","v":1380}]
[null,null,1100,"LINK_1100",null,"NB I-39/90","CD","CD: b/n ramps",{"$f":"INDEX(Balancing!$L$11:$L$102,MATCH($C17,Balancing!$D$11:$D$102,0))","v":120}]
[null,null,1110,"LINK_1110",null,"NB I-39/90","on","CD: on from NB US 151",{"$f":"INDEX(Balancing!$L$11:$L$102,MATCH($C18,Balancing!$D$11:$D$102,0))","v":70}]
[null,null,1120,"LINK_1120",null,"NB I-39/90","off","CD: off to SB US 151",{"$f":"INDEX(Balancing!$L$11:$L$102,MATCH($C19,Balancing!$D$11:$D$102,0))","v":120}]
[null,null,1130,"LINK_1130",null,"NB I-39/90","CD","CD: b/n ramps",{"$f":"INDEX(Balancing!$L$11:$L$102,MATCH($C20,Balancing!$D$11:$D$102,0))","v":70}]
{"$rows_left_out":79}
{"sheet":"Data Validation","index":5,"n_rows":10,"n_cols":8,"rows_kept":10,"cut":false,"hidden":true,"merged":[]}
[]
[null,null,null,"Allowed values in Columns using \"Data Validation\" Drop-down Cells"]
[]
[null,null,null,"Corridor Worksheet",null,null,null,"Balancing Worksheet"]
[null,null,null,"Affects 2+\nCorridors?","Type",null,null,"Capacity Weight"]
[null,null,null,"Primary","on",null,null,"Hourly"]
[null,null,null,"Secondary","off",null,null,"AADT"]
[null,null,null,null,"CD"]
[null,null,null,null,"mainline"]
[null,null,null,null,"mainline."]