{"text_format":"1","workbook":"xlsx","n_sheets":6,"sheets":["Corridor","Raw-Initial Volumes","Balancing","Diagnostics","Export To Intersection Balancer","Data Validation"],"not_rendered":{"charts":0,"images":1,"macros":1,"external_links":0,"defined_names":120,"comments":5,"pivot_tables":0},"unopened":[],"bounds":{"document_bytes":16777216,"sheet_cells":100000,"rows_first":2000,"rows_last":500,"rows_between":2000,"halvings":0,"cell_chars":16384,"cell_head_chars":4096},"cells_cut":0,"cells_raw":0,"read":"whole","date_system":"1900"}

{"sheet":"Corridor","index":0,"n_rows":30,"n_cols":10,"rows_kept":30,"cut":false,"hidden":false,"merged":[]}
[null,null,null,"Project","Example 1"]
[null,null,null,"Scenario","Existing 2019 PM Peak"]
[]
[null,null,null,"Location Information"]
[]
[null,null,null,"Corridor","Corridor & Direction","Link ID","Affects 2+\nCorridors?","# of Lanes","Type","Location"]
[null,null,null,"EB STH 99","EB STH 99",1000,null,2,"mainline","EB STH 99, west of CTH X"]
[null,null,null,null,"EB STH 99",1001,null,1,"on","on from CTH X"]
[null,null,null,null,"EB STH 99",1002,null,2,"mainline."]
[null,null,null,null,"EB STH 99",1003,null,1,"off","off to CTH  A"]
[null,null,null,null,"EB STH 99",1004,null,2,"mainline."]
[null,null,null,null,"EB STH 99",1005,null,1,"on","on from CTH  A"]
[null,null,null,null,"EB STH 99",1006,null,2,"mainline."]
[null,null,null,null,"EB STH 99",1007,"Primary",1,"on","on from NB US 123"]
[null,null,null,null,"EB STH 99",1008,null,2,"mainline."]
[null,null,null,null,"EB STH 99",1009,null,1,"off","off to CTH B"]
[null,null,null,null,"EB STH 99",1010,null,2,"mainline."]
[null,null,null,null,"EB STH 99",1011,null,1,"on","on from CTH B"]
[null,null,null,null,"EB STH 99",1012,null,2,"mainline","EB STH 99, east of CTH B"]
[null,null,null,"NB US 123","NB US 123",2000,null,2,"mainline","NB US 123, south of STH 1"]
{"$rows_left_out":11}
{"sheet":"Raw-Initial Volumes","index":1,"n_rows":33,"n_cols":38,"rows_kept":33,"cut":false,"hidden":false,"merged":[[5,36,5,37]]}
[null,null,null,"Project",{"$f":"project_name","v":"Example 1"}]
[null,null,null,"Scenario",{"$f":"scenario_name","v":"Existing 2019 PM Peak"}]
[]
[]
[]
[null,null,null,"Location Information",null,null,null,null,null,null,"Raw/Initial Traffic Volumes",null,null,null,null,null,null,null,null,null,null,null,null,null,null,null,null,null,null,null,null,null,null,null,null,null,"Initial Input to Volume Balancing"]
[null,null,null,null,null,null,null,null,null,null,"AADT",null,null,null,null,null,"ATR",null,null,null,"V-SPOC",null,null,null,"Tube Count 1",null,null,null,"Tube Count 2",null,null,null,"Turning Movement Count"]
[]
[null,null,"SORT","Corridor","Corridor & Direction","Link ID","Affects 2+\nCorridors?","# of Lanes","Type","Location","TRADAS ID","Year","AADT","K-factor","Hourly Volume","Comments","Date","Hour","Volume","Comments","Date","Hour","Volume","Comments","Date","Hour","Volume","Comments","Date","Hour","Volume","Comments","Date","Hour","Volume","Comments","Source / Comments","Raw\nVolume"]
[null,null,1,"EB STH 99","EB STH 99",1000,null,2,"mainline","EB STH 99, west of CTH X",null,null,null,null,null,null,"2019-01-01","16:00:00",2053,null,null,null,null,null,null,null,null,null,null,null,null,null,null,null,null,null,"ATR",{"$f":"S10","v":2053}]
[null,null,2,null,"EB STH 99",1001,null,1,"on","on from CTH X",null,null,null,null,null,null,null,null,null,null,null,null,null,null,"2017-02-02","16:00:00",348,null,null,null,null,null,null,null,null,null,"Tube",{"$f":"AA11","v":348}]
[null,null,3,null,"EB STH 99",1002,null,2,"mainline."]
[null,null,4,null,"EB STH 99",1003,null,1,"off","off to CTH  A",null,null,null,null,null,null,null,null,null,null,"2019-01-01","16:00:00",547,null,"2015-03-03","16:00:00",623,null,null,null,null,null,null,null,null,null,"V-SPOC",{"$f":"W13","v":547}]
[null,null,5,null,"EB STH 99",1004,null,2,"mainline."]
[null,null,6,null,"EB STH 99",1005,null,1,"on","on from CTH  A",null,null,null,null,null,null,null,null,null,null,null,null,null,null,"2015-03-03","16:00:00",528,null,null,null,null,null,null,null,null,null,"Tube",{"$f":"AA15","v":528}]
[null,null,7,null,"EB STH 99",1006,null,2,"mainline."]
[null,null,8,null,"EB STH 99",1007,"Primary",1,"on","on from NB US 123",null,null,null,null,null,null,null,null,null,null,null,null,null,null,"2019-04-04","16:00:00",1263,null,null,null,null,null,null,null,null,null,"Tube",{"$f":"AA17","v":1263}]
[null,null,9,null,"EB STH 99",1008,null,2,"mainline."]
[null,null,10,null,"EB STH 99",1009,null,1,"off","off to CTH B",null,null,null,null,null,null,null,null,null,null,null,null,null,null,"2018-06-06","16:00:00",500,null,null,null,null,null,null,null,null,null,"Tube",{"$f":"AA19","v":500}]
[null,null,11,null,"EB STH 99",1010,null,2,"mainline."]
{"$rows_left_out":14}
{"sheet":"Balancing","index":2,"n_rows":34,"n_cols":29,"rows_kept":34,"cut":false,"hidden":false,"merged":[[6,11,7,11],[6,20,7,20],[6,9,8,10]]}
[null,"*** Do not sort this worksheet***",null,null,null,null,null,null,"Green highlighted cells demonstrate user inputs.  See the notes on each highlighted cell for more info"]
[null,"Filtering is ok, but sorting may cause errors in the Solver volumes, cumulative sums, and potentially the FINAL volumes.",null,null,null,null,null,null,"The automated balancing has not been run yet.  Try runnig it, restting it, playing with the Weight Adjustments, Fixed Anchor, etc."]
[null,"Use the Diagnostics sheet for sorting data."]
[null,"Location Information",null,null,null,null,null,null,"Balancing"]
[null,"Project",{"$f":"project_name","v":"Example 1"},null,null,null,null,null,"User Inputs - Volumes",null,null,null,"Raw vs Balanced Comparison",null,null,"User Inputs - Solver",null,null,"Solver Objective & Penalty Functions"]
[null,"Scenario",{"$f":"scenario_name","v":"Existing 2019 PM Peak"},null,null,null,null,null,null,null,null,null,"Also shown on \"Diagnostics\" worksheet",null,null,null,null,null,{"$f":"total_wRNSE*W8+sd_wRNSE*X8+total_wLargeRNSE*Y8+total_fixedPenalty","v":1609.5813067727777},"Solver Objective",null,null,null,"Large RNSE Penalty Threshold",3,null,null,null,"Check for Blank Cells (show warning)"]
[null,null,null,null,null,null,null,null,null,"Selected Raw/Initial Count used to start balancing",null,"Volume Type",null,null,null,null,null,null,null,null,"Network Weight","Normalization Factors",0,0,0,null,null,null,true]
[null,null,null,null,null,null,null,null,null,null,null,null,null,null,null,null,null,null,null,null,null,"theta:",{"$f":"1/MAX(normFactor_wRNSE, 0.1)","v":10},{"$f":"1/MAX(normFactor_SD, 0.1)","v":10},{"$f":"1/MAX(normFactor_wLargeRNSE, 0.1)","v":10},null,null,null,"First Solver Run?"]
[null,null,null,null,null,null,null,null,null,null,null,"Hourly","Totals",{"$f":"SUM($N11:$N34)","v":12.03691446385152},null,null,null,null,null,null,{"$f":"SUM($U11:$U34)","v":6.4159999999999995},null,{"$f":"SUM($W11:$W34)","v":116.09069151029585},{"$f":"_xlfn.STDEV.P($W11:$W34)","v":13.411276508058663},{"$f":"SUM($Y11:$Y34)","v":31.456162658923255},{"$f":"SUM($Z11:$Z34)","v":0},null,null,true]
[null,"Corridor","Corridor & Direction","Link ID","Affects 2+\nCorridors?","# of Lanes","Location\nType","Location","Ramp\nSign","Source / Comments","Raw/Initial\nVolume","FINAL Balanced Volumes","Diff","RNSE","Comments","Include as a Solver Variable?","Fixed Anchor","Weight Adjustment","Global Weight\nRank","Capacity Weight","Weight Product\n(Cap. * Adj.)","Global Weight","Weighted RNSE Penalty","Weighted SD Penalty","Weighted Large RNSE Penalty","Fixed Anchor Penalty",null,null,"DO NOT USE OR DELETE THIS COLUMN"]
[null,"EB STH 99","EB STH 99",1000,null,2,"mainline","EB STH 99, west of CTH X",null,{"$f":"IF($K11>0,INDEX('Raw-Initial Volumes'!$AK$10:$AK$33,MATCH($D11,'Raw-Initial Volumes'!$F$10:$F$33,0)),\"\")","v":"ATR"},{"$f":"INDEX('Raw-Initial Volumes'!$AL$10:$AL$33,MATCH($D11,'Raw-Initial Volumes'!$F$10:$F$33,0))","v":2053},{"$f":"K11","v":2053},{"$f":"IF(K11>0,L11-K11,0)","v":0},{"$f":"IF(K11>0,SQRT(M11^2/K11),0)","v":0},null,true,null,1,{"$f":"IF(NOT($Q11=\"Fixed\"),1+SUMPRODUCT(NOT($Q$11:$Q$34=\"Fixed\")*($V$11:$V$34>$V11)),\"\")","v":5},{"$f":"Capacity_Weight(K11/F11,capweight_scale)","v":0.51324999999999998},{"$f":"T11*R11*IF(E11=\"Secondary\",0,1)","v":0.51324999999999998},{"$f":"U11/network_weight*100","v":7.9995324189526196},{"$f":"N11*V11","v":0},null,{"$f":"V11*MAX(N11-$Y$6,0)^2","v":0},{"$f":"IF(Q11=\"Fixed\",999*(L11-K11)^2,0)","v":0}]
[null,null,"EB STH 99",1001,null,1,"on","on from CTH X",1,{"$f":"IF($K12>0,INDEX('Raw-Initial Volumes'!$AK$10:$AK$33,MATCH($D12,'Raw-Initial Volumes'!$F$10:$F$33,0)),\"\")","v":"Tube"},{"$f":"INDEX('Raw-Initial Volumes'!$AL$10:$AL$33,MATCH($D12,'Raw-Initial Volumes'!$F$10:$F$33,0))","v":348},{"$f":"K12","v":348},0,0,null,true,null,1,14,{"$f":"Capacity_Weight(K12/F12,capweight_scale)","v":0.17399999999999999},0.17399999999999999,{"$f":"U12/network_weight*100","v":2.7119700748129678},0,null,0,0]
[null,null,"EB STH 99",1002,null,2,"mainline.",null,null,{"$f":"IF($K13>0,INDEX('Raw-Initial Volumes'!$AK$10:$AK$33,MATCH($D13,'Raw-Initial Volumes'!$F$10:$F$33,0)),\"\")","v":""},{"$f":"INDEX('Raw-Initial Volumes'!$AL$10:$AL$33,MATCH($D13,'Raw-Initial Volumes'!$F$10:$F$33,0))","v":0},{"$f":"L11+L12","v":2401},0,0,null,null,null,1,16,{"$f":"Capacity_Weight(K13/F13,capweight_scale)","v":0},0,{"$f":"U13/network_weight*100","v":0},0,null,0,0]
[null,null,"EB STH 99",1003,null,1,"off","off to CTH  A",-1,{"$f":"IF($K14>0,INDEX('Raw-Initial Volumes'!$AK$10:$AK$33,MATCH($D14,'Raw-Initial Volumes'!$F$10:$F$33,0)),\"\")","v":"V-SPOC"},{"$f":"INDEX('Raw-Initial Volumes'!$AL$10:$AL$33,MATCH($D14,'Raw-Initial Volumes'!$F$10:$F$33,0))","v":547},{"$f":"K14","v":547},0,0,null,true,null,1,11,{"$f":"Capacity_Weight(K14/F14,capweight_scale)","v":0.27350000000000002},0.27350000000000002,{"$f":"U14/network_weight*100","v":4.2627805486284291},0,null,0,0]
[null,null,"EB STH 99",1004,null,2,"mainline.",null,null,{"$f":"IF($K15>0,INDEX('Raw-Initial Volumes'!$AK$10:$AK$33,MATCH($D15,'Raw-Initial Volumes'!$F$10:$F$33,0)),\"\")","v":""},{"$f":"INDEX('Raw-Initial Volumes'!$AL$10:$AL$33,MATCH($D15,'Raw-Initial Volumes'!$F$10:$F$33,0))","v":0},{"$f":"L13-L14","v":1854},0,0,null,null,null,1,16,{"$f":"Capacity_Weight(K15/F15,capweight_scale)","v":0},0,{"$f":"U15/network_weight*100","v":0},0,null,0,0]
[null,null,"EB STH 99",1005,null,1,"on","on from CTH  A",1,{"$f":"IF($K16>0,INDEX('Raw-Initial Volumes'!$AK$10:$AK$33,MATCH($D16,'Raw-Initial Volumes'!$F$10:$F$33,0)),\"\")","v":"Tube"},{"$f":"INDEX('Raw-Initial Volumes'!$AL$10:$AL$33,MATCH($D16,'Raw-Initial Volumes'!$F$10:$F$33,0))","v":528},{"$f":"K16","v":528},0,0,null,true,null,1,12,{"$f":"Capacity_Weight(K16/F16,capweight_scale)","v":0.26400000000000001},0.26400000000000001,{"$f":"U16/network_weight*100","v":4.1147132169576066},0,null,0,0]
[null,null,"EB STH 99",1006,null,2,"mainline.",null,null,{"$f":"IF($K17>0,INDEX('Raw-Initial Volumes'!$AK$10:$AK$33,MATCH($D17,'Raw-Initial Volumes'!$F$10:$F$33,0)),\"\")","v":""},{"$f":"INDEX('Raw-Initial Volumes'!$AL$10:$AL$33,MATCH($D17,'Raw-Initial Volumes'!$F$10:$F$33,0))","v":0},{"$f":"$L$11+SUMPRODUCT($I$12:I16,$L$12:L16)","v":2382},0,0,null,null,null,1,16,{"$f":"Capacity_Weight(K17/F17,capweight_scale)","v":0},0,{"$f":"U17/network_weight*100","v":0},0,null,0,0]
[null,null,"EB STH 99",1007,"Primary",1,"on","on from NB US 123",1,{"$f":"IF($K18>0,INDEX('Raw-Initial Volumes'!$AK$10:$AK$33,MATCH($D18,'Raw-Initial Volumes'!$F$10:$F$33,0)),\"\")","v":"Tube"},{"$f":"INDEX('Raw-Initial Volumes'!$AL$10:$AL$33,MATCH($D18,'Raw-Initial Volumes'!$F$10:$F$33,0))","v":1263},{"$f":"K18","v":1263},0,0,null,true,null,1,4,{"$f":"Capacity_Weight(K18/F18,capweight_scale)","v":0.63149999999999995},0.63149999999999995,{"$f":"U18/network_weight*100","v":9.8425810473815467},0,null,0,0]
[null,null,"EB STH 99",1008,null,2,"mainline.",null,null,{"$f":"IF($K19>0,INDEX('Raw-Initial Volumes'!$AK$10:$AK$33,MATCH($D19,'Raw-Initial Volumes'!$F$10:$F$33,0)),\"\")","v":""},{"$f":"INDEX('Raw-Initial Volumes'!$AL$10:$AL$33,MATCH($D19,'Raw-Initial Volumes'!$F$10:$F$33,0))","v":0},{"$f":"$L$11+SUMPRODUCT($I$12:I18,$L$12:L18)","v":3645},0,0,null,null,null,1,16,{"$f":"Capacity_Weight(K19/F19,capweight_scale)","v":0},0,{"$f":"U19/network_weight*100","v":0},0,null,0,0]
[null,null,"EB STH 99",1009,null,1,"off","off to CTH B",-1,{"$f":"IF($K20>0,INDEX('Raw-Initial Volumes'!$AK$10:$AK$33,MATCH($D20,'Raw-Initial Volumes'!$F$10:$F$33,0)),\"\")","v":"Tube"},{"$f":"INDEX('Raw-Initial Volumes'!$AL$10:$AL$33,MATCH($D20,'Raw-Initial Volumes'!$F$10:$F$33,0))","v":500},{"$f":"K20","v":500},0,0,null,true,null,1,13,{"$f":"Capacity_Weight(K20/F20,capweight_scale)","v":0.25},0.25,{"$f":"U20/network_weight*100","v":3.8965087281795512},0,null,0,0]
{"$rows_left_out":15}
{"sheet":"Diagnostics","index":3,"n_rows":31,"n_cols":22,"rows_kept":31,"cut":false,"hidden":false,"merged":[]}
[]
[null,null,null,"Project",{"$f":"project_name","v":"Example 1"}]
[null,null,null,"Scenario",{"$f":"scenario_name","v":"Existing 2019 PM Peak"}]
[]
[null,null,null,"Location Information",null,null,null,null,null,null,"Raw vs Balanced Comparison",null,null,null,null,null,"Solver Diagnostics"]
[]
[null,null,"SORT","Corridor","Corridor & Direction","Link ID","Affects 2+\nCorridors?","# of Lanes","Type","Location","Raw Source / Comments","Raw","Balanced\nFINAL","Diff","RNSE","Comments","Solver Inputs","Input Global Weight","Input Global Weight\nRank","Solver Outputs","Final vs Solver Outputs","First Run Formula"]
[null,null,1,"EB STH 99","EB STH 99",1000,null,2,"mainline","EB STH 99, west of CTH X",{"$f":"INDEX(Balancing!$J$11:$J$34,MATCH($F8,Balancing!$D$11:$D$34,0))","v":"ATR"},{"$f":"INDEX(Balancing!$K$11:$K$34,MATCH($F8,Balancing!$D$11:$D$34,0))","v":2053},{"$f":"INDEX(Balancing!$L$11:$L$34,MATCH($F8,Balancing!$D$11:$D$34,0))","v":2053},{"$f":"IF($L8>0,$M8-$L8,\"\")","v":0},{"$f":"IF($L8>0,SQRT($N8^2/$L8),\"\")","v":0},{"$f":"INDEX(Balancing!$O$11:$O$34,MATCH($F8,Balancing!$D$11:$D$34,0))","v":0},null,{"$f":"INDEX(Balancing!$V$11:$V$34,MATCH($F8,Balancing!$D$11:$D$34,0))","v":7.9995324189526196},{"$f":"INDEX(Balancing!$S$11:$S$34,MATCH($F8,Balancing!$D$11:$D$34,0))","v":5},null,{"$f":"M8-T8","v":2053}]
[null,null,2,null,"EB STH 99",1001,null,1,"on","on from CTH X",{"$f":"INDEX(Balancing!$J$11:$J$34,MATCH($F9,Balancing!$D$11:$D$34,0))","v":"Tube"},{"$f":"INDEX(Balancing!$K$11:$K$34,MATCH($F9,Balancing!$D$11:$D$34,0))","v":348},{"$f":"INDEX(Balancing!$L$11:$L$34,MATCH($F9,Balancing!$D$11:$D$34,0))","v":348},0,0,{"$f":"INDEX(Balancing!$O$11:$O$34,MATCH($F9,Balancing!$D$11:$D$34,0))","v":0},null,{"$f":"INDEX(Balancing!$V$11:$V$34,MATCH($F9,Balancing!$D$11:$D$34,0))","v":2.7119700748129678},{"$f":"INDEX(Balancing!$S$11:$S$34,MATCH($F9,Balancing!$D$11:$D$34,0))","v":14},null,348]
[null,null,3,null,"EB STH 99",1002,null,2,"mainline.",null,{"$f":"INDEX(Balancing!$J$11:$J$34,MATCH($F10,Balancing!$D$11:$D$34,0))","v":""},{"$f":"INDEX(Balancing!$K$11:$K$34,MATCH($F10,Balancing!$D$11:$D$34,0))","v":0},{"$f":"INDEX(Balancing!$L$11:$L$34,MATCH($F10,Balancing!$D$11:$D$34,0))","v":2401},"","",{"$f":"INDEX(Balancing!$O$11:$O$34,MATCH($F10,Balancing!$D$11:$D$34,0))","v":0},null,{"$f":"INDEX(Balancing!$V$11:$V$34,MATCH($F10,Balancing!$D$11:$D$34,0))","v":0},{"$f":"INDEX(Balancing!$S$11:$S$34,MATCH($F10,Balancing!$D$11:$D$34,0))","v":16},null,2401]
[null,null,4,null,"EB STH 99",1003,null,1,"off","off to CTH  A",{"$f":"INDEX(Balancing!$J$11:$J$34,MATCH($F11,Balancing!$D$11:$D$34,0))","v":"V-SPOC"},{"$f":"INDEX(Balancing!$K$11:$K$34,MATCH($F11,Balancing!$D$11:$D$34,0))","v":547},{"$f":"INDEX(Balancing!$L$11:$L$34,MATCH($F11,Balancing!$D$11:$D$34,0))","v":547},0,0,{"$f":"INDEX(Balancing!$O$11:$O$34,MATCH($F11,Balancing!$D$11:$D$34,0))","v":0},null,{"$f":"INDEX(Balancing!$V$11:$V$34,MATCH($F11,Balancing!$D$11:$D$34,0))","v":4.2627805486284291},{"$f":"INDEX(Balancing!$S$11:$S$34,MATCH($F11,Balancing!$D$11:$D$34,0))","v":11},null,547]
[null,null,5,null,"EB STH 99",1004,null,2,"mainline.",null,{"$f":"INDEX(Balancing!$J$11:$J$34,MATCH($F12,Balancing!$D$11:$D$34,0))","v":""},{"$f":"INDEX(Balancing!$K$11:$K$34,MATCH($F12,Balancing!$D$11:$D$34,0))","v":0},{"$f":"INDEX(Balancing!$L$11:$L$34,MATCH($F12,Balancing!$D$11:$D$34,0))","v":1854},"","",{"$f":"INDEX(Balancing!$O$11:$O$34,MATCH($F12,Balancing!$D$11:$D$34,0))","v":0},null,{"$f":"INDEX(Balancing!$V$11:$V$34,MATCH($F12,Balancing!$D$11:$D$34,0))","v":0},{"$f":"INDEX(Balancing!$S$11:$S$34,MATCH($F12,Balancing!$D$11:$D$34,0))","v":16},null,1854]
[null,null,6,null,"EB STH 99",1005,null,1,"on","on from CTH  A",{"$f":"INDEX(Balancing!$J$11:$J$34,MATCH($F13,Balancing!$D$11:$D$34,0))","v":"Tube"},{"$f":"INDEX(Balancing!$K$11:$K$34,MATCH($F13,Balancing!$D$11:$D$34,0))","v":528},{"$f":"INDEX(Balancing!$L$11:$L$34,MATCH($F13,Balancing!$D$11:$D$34,0))","v":528},0,0,{"$f":"INDEX(Balancing!$O$11:$O$34,MATCH($F13,Balancing!$D$11:$D$34,0))","v":0},null,{"$f":"INDEX(Balancing!$V$11:$V$34,MATCH($F13,Balancing!$D$11:$D$34,0))","v":4.1147132169576066},{"$f":"INDEX(Balancing!$S$11:$S$34,MATCH($F13,Balancing!$D$11:$D$34,0))","v":12},null,528]
[null,null,7,null,"EB STH 99",1006,null,2,"mainline.",null,{"$f":"INDEX(Balancing!$J$11:$J$34,MATCH($F14,Balancing!$D$11:$D$34,0))","v":""},{"$f":"INDEX(Balancing!$K$11:$K$34,MATCH($F14,Balancing!$D$11:$D$34,0))","v":0},{"$f":"INDEX(Balancing!$L$11:$L$34,MATCH($F14,Balancing!$D$11:$D$34,0))","v":2382},"","",{"$f":"INDEX(Balancing!$O$11:$O$34,MATCH($F14,Balancing!$D$11:$D$34,0))","v":0},null,{"$f":"INDEX(Balancing!$V$11:$V$34,MATCH($F14,Balancing!$D$11:$D$34,0))","v":0},{"$f":"INDEX(Balancing!$S$11:$S$34,MATCH($F14,Balancing!$D$11:$D$34,0))","v":16},null,2382]
[null,null,8,null,"EB STH 99",1007,"Primary",1,"on","on from NB US 123",{"$f":"INDEX(Balancing!$J$11:$J$34,MATCH($F15,Balancing!$D$11:$D$34,0))","v":"Tube"},{"$f":"INDEX(Balancing!$K$11:$K$34,MATCH($F15,Balancing!$D$11:$D$34,0))","v":1263},{"$f":"INDEX(Balancing!$L$11:$L$34,MATCH($F15,Balancing!$D$11:$D$34,0))","v":1263},0,0,{"$f":"INDEX(Balancing!$O$11:$O$34,MATCH($F15,Balancing!$D$11:$D$34,0))","v":0},null,{"$f":"INDEX(Balancing!$V$11:$V$34,MATCH($F15,Balancing!$D$11:$D$34,0))","v":9.8425810473815467},{"$f":"INDEX(Balancing!$S$11:$S$34,MATCH($F15,Balancing!$D$11:$D$34,0))","v":4},null,1263]
[null,null,9,null,"EB STH 99",1008,null,2,"mainline.",null,{"$f":"INDEX(Balancing!$J$11:$J$34,MATCH($F16,Balancing!$D$11:$D$34,0))","v":""},{"$f":"INDEX(Balancing!$K$11:$K$34,MATCH($F16,Balancing!$D$11:$D$34,0))","v":0},{"$f":"INDEX(Balancing!$L$11:$L$34,MATCH($F16,Balancing!$D$11:$D$34,0))","v":3645},"","",{"$f":"INDEX(Balancing!$O$11:$O$34,MATCH($F16,Balancing!$D$11:$D$34,0))","v":0},null,{"$f":"INDEX(Balancing!$V$11:$V$34,MATCH($F16,Balancing!$D$11:$D$34,0))","v":0},{"$f":"INDEX(Balancing!$S$11:$S$34,MATCH($F16,Balancing!$D$11:$D$34,0))","v":16},null,3645]
[null,null,10,null,"EB STH 99",1009,null,1,"off","off to CTH B",{"$f":"INDEX(Balancing!$J$11:$J$34,MATCH($F17,Balancing!$D$11:$D$34,0))","v":"Tube"},{"$f":"INDEX(Balancing!$K$11:$K$34,MATCH($F17,Balancing!$D$11:$D$34,0))","v":500},{"$f":"INDEX(Balancing!$L$11:$L$34,MATCH($F17,Balancing!$D$11:$D$34,0))","v":500},0,0,{"$f":"INDEX(Balancing!$O$11:$O$34,MATCH($F17,Balancing!$D$11:$D$34,0))","v":0},null,{"$f":"INDEX(Balancing!$V$11:$V$34,MATCH($F17,Balancing!$D$11:$D$34,0))","v":3.8965087281795512},{"$f":"INDEX(Balancing!$S$11:$S$34,MATCH($F17,Balancing!$D$11:$D$34,0))","v":13},null,500]
[null,null,11,null,"EB STH 99",1010,null,2,"mainline.",null,{"$f":"INDEX(Balancing!$J$11:$J$34,MATCH($F18,Balancing!$D$11:$D$34,0))","v":""},{"$f":"INDEX(Balancing!$K$11:$K$34,MATCH($F18,Balancing!$D$11:$D$34,0))","v":0},{"$f":"INDEX(Balancing!$L$11:$L$34,MATCH($F18,Balancing!$D$11:$D$34,0))","v":3145},"","",{"$f":"INDEX(Balancing!$O$11:$O$34,MATCH($F18,Balancing!$D$11:$D$34,0))","v":0},null,{"$f":"INDEX(Balancing!$V$11:$V$34,MATCH($F18,Balancing!$D$11:$D$34,0))","v":0},{"$f":"INDEX(Balancing!$S$11:$S$34,MATCH($F18,Balancing!$D$11:$D$34,0))","v":16},null,3145]
[null,null,12,null,"EB STH 99",1011,null,1,"on","on from CTH B",{"$f":"INDEX(Balancing!$J$11:$J$34,MATCH($F19,Balancing!$D$11:$D$34,0))","v":"Tube"},{"$f":"INDEX(Balancing!$K$11:$K$34,MATCH($F19,Balancing!$D$11:$D$34,0))","v":265},{"$f":"INDEX(Balancing!$L$11:$L$34,MATCH($F19,Balancing!$D$11:$D$34,0))","v":265},0,0,{"$f":"INDEX(Balancing!$O$11:$O$34,MATCH($F19,Balancing!$D$11:$D$34,0))","v":0},null,{"$f":"INDEX(Balancing!$V$11:$V$34,MATCH($F19,Balancing!$D$11:$D$34,0))","v":2.0651496259351618},{"$f":"INDEX(Balancing!$S$11:$S$34,MATCH($F19,Balancing!$D$11:$D$34,0))","v":15},null,265]
[null,null,13,null,"EB STH 99",1012,null,2,"mainline","EB STH 99, east of CTH B",{"$f":"INDEX(Balancing!$J$11:$J$34,MATCH($F20,Balancing!$D$11:$D$34,0))","v":"Tube"},{"$f":"INDEX(Balancing!$K$11:$K$34,MATCH($F20,Balancing!$D$11:$D$34,0))","v":3175},{"$f":"INDEX(Balancing!$L$11:$L$34,MATCH($F20,Balancing!$D$11:$D$34,0))","v":3410},235,4.1705755942557348,{"$f":"INDEX(Balancing!$O$11:$O$34,MATCH($F20,Balancing!$D$11:$D$34,0))","v":0},null,{"$f":"INDEX(Balancing!$V$11:$V$34,MATCH($F20,Balancing!$D$11:$D$34,0))","v":12.371415211970076},{"$f":"INDEX(Balancing!$S$11:$S$34,MATCH($F20,Balancing!$D$11:$D$34,0))","v":1},null,3410]
{"$rows_left_out":12}
{"sheet":"Export To Intersection Balancer","index":4,"n_rows":30,"n_cols":9,"rows_kept":30,"cut":false,"hidden":false,"merged":[[4,3,4,8]]}
[]
[null,null,null,null,"Project",{"$f":"project_name","v":"Example 1"}]
[null,null,null,null,"Scenario",{"$f":"scenario_name","v":"Existing 2019 PM Peak"}]
[]
[null,null,null,"Copy this Data to the Turning Movement Balancing Workbook"]
[null,null,"LINK_ID\n(no prefix)","LINK_ID","Corridor","Corridor & Direction","Type","Location","Balanced\nVolume"]
[null,null,1000,{"$f":"\"LINK_\" & $C7","v":"LINK_1000"},"EB STH 99","EB STH 99","mainline","EB STH 99, west of CTH X",{"$f":"INDEX(Balancing!$L$11:$L$34,MATCH($C7,Balancing!$D$11:$D$34,0))","v":2053}]
[null,null,1001,"LINK_1001",null,"EB STH 99","on","on from CTH X",{"$f":"INDEX(Balancing!$L$11:$L$34,MATCH($C8,Balancing!$D$11:$D$34,0))","v":348}]
[null,null,1002,"LINK_1002",null,"EB STH 99","mainline.",null,{"$f":"INDEX(Balancing!$L$11:$L$34,MATCH($C9,Balancing!$D$11:$D$34,0))","v":2401}]
[null,null,1003,"LINK_1003",null,"EB STH 99","off","off to CTH  A",{"$f":"INDEX(Balancing!$L$11:$L$34,MATCH($C10,Balancing!$D$11:$D$34,0))","v":547}]
[null,null,1004,"LINK_1004",null,"EB STH 99","mainline.",null,{"$f":"INDEX(Balancing!$L$11:$L$34,MATCH($C11,Balancing!$D$11:$D$34,0))","v":1854}]
[null,null,1005,"LINK_1005",null,"EB STH 99","on","on from CTH  A",{"$f":"INDEX(Balancing!$L$11:$L$34,MATCH($C12,Balancing!$D$11:$D$34,0))","v":528}]
[null,null,1006,"LINK_1006",null,"EB STH 99","mainline.",null,{"$f":"INDEX(Balancing!$L$11:$L$34,MATCH($C13,Balancing!$D$11:$D$34,0))","v":2382}]
[null,null,1007,"LINK_1007",null,"EB STH 99","on","on from NB US 123",{"$f":"INDEX(Balancing!$L$11:$L$34,MATCH($C14,Balancing!$D$11:$D$34,0))","v":1263}]
[null,null,1008,"LINK_1008",null,"EB STH 99","mainline.",null,{"$f":"INDEX(Balancing!$L$11:$L$34,MATCH($C15,Balancing!$D$11:$D$34,0))","v":3645}]
[null,null,1009,"LINK_1009",null,"EB STH 99","off","off to CTH B",{"$f":"INDEX(Balancing!$L$11:$L$34,MATCH($C16,Balancing!$D$11:$D$34,0))","v":500}]
[null,null,1010,"LINK_1010",null,"EB STH 99","mainline.",null,{"$f":"INDEX(Balancing!$L$11:$L$34,MATCH($C17,Balancing!$D$11:$D$34,0))","v":3145}]
[null,null,1011,"LINK_1011",null,"EB STH 99","on","on from CTH B",{"$f":"INDEX(Balancing!$L$11:$L$34,MATCH($C18,Balancing!$D$11:$D$34,0))","v":265}]
[null,null,1012,"LINK_1012",null,"EB STH 99","mainline","EB STH 99, east of CTH B",{"$f":"INDEX(Balancing!$L$11:$L$34,MATCH($C19,Balancing!$D$11:$D$34,0))","v":3410}]
[null,null,2000,"LINK_2000","NB US 123","NB US 123","mainline","NB US 123, south of STH 1",{"$f":"INDEX(Balancing!$L$11:$L$34,MATCH($C20,Balancing!$D$11:$D$34,0))","v":2678}]
{"$rows_left_out":11}
{"sheet":"Data Validation","index":5,"n_rows":10,"n_cols":8,"rows_kept":10,"cut":false,"hidden":true,"merged":[]}
[]
[null,null,null,"Allowed values in Columns using \"Data Validation\" Drop-down Cells"]
[]
[null,null,null,"Corridor Worksheet",null,null,null,"Balancing Worksheet"]
[null,null,null,"Affects 2+\nCorridors?","Type",null,null,"Capacity Weight"]
[null,null,null,"Primary","on",null,null,"Hourly"]
[null,null,null,"Secondary","off",null,null,"AADT"]
[null,null,null,null,"CD"]
[null,null,null,null,"mainline"]
[null,null,null,null,"mainline."]